{"text_format":"1","workbook":"xlsx","n_sheets":11,"sheets":["GUÍA","Cotizador","Captura","Resumen","Deducible","Referencia","Plazo 1","Plazo 2","Plazo 3","Plazo 4","Plazo 5"],"not_rendered":{"charts":0,"images":3,"macros":1,"external_links":0,"defined_names":9,"comments":1,"pivot_tables":0},"unopened":[],"bounds":{"document_bytes":16777216,"sheet_cells":100000,"rows_first":2000,"rows_last":500,"rows_between":2000,"halvings":0,"cell_chars":16384,"cell_head_chars":4096},"cells_cut":0,"cells_raw":0,"read":"whole","date_system":"1900"}

{"sheet":"GUÍA","index":0,"n_rows":93,"n_cols":7,"rows_kept":93,"cut":false,"hidden":false,"merged":[[6,2,6,3],[8,2,8,3],[10,2,10,3],[12,2,12,3],[16,2,17,3]]}
[null,"COTIZACIÓN DE ARRENDAMIENTO PURO"]
[null,null,null,null,null,"Folio"]
[null,null,null,null,null,"Fecha",{"$f":"TODAY()","v":"2026-03-04"}]
[]
[]
[null,null,null,null,"Régimen"]
[null,"Cliente",null,null,"Moral"]
[]
[null,"Contacto"]
[]
[null,"Teléfono"]
[]
[null,"E-mail"]
[]
[null,"Tipo de vehículo","Vehículo utilitario"]
[]
[null,"Descripción del activo"]
[]
[]
[null,"Valor factura sin IVA",{"$f":"C24/1.16","v":0}]
[]
[null,"IVA",{"$f":"C20*0.16","v":0}]
[]
[null,"Valor factura con IVA"]
[]
[null,"Plazo (meses)",18,24,36,48,60]
[]
[]
[null,"Anticipo",0.15]
[]
[null,"Renta en depósito","Si"]
[]
[null,"Flotilla (5 autos o mas)","Si"]
[]
[null,"Residual",0,0,0,0,0]
[]
[null,"Seguro financiado","Si"]
[]
[null,"Seguro anual sin IVA",0]
[]
[null,"Comisión Referencia",0.02]
[]
[null,"Tipo de auto",1]
[]
[null,"Gasolina / Diesel",1]
[null,"Eléctrico / Híbrido",2]
[null,"Carga / Transporte",3]
[]
[null,null,18,24,36,48,60]
[null,"Valores sin IVA"]
[null,"Renta Mensual",0,0,0,0,0]
[]
[null,"GMOV ",0,0,0,0,0]
[]
[null,"GPS",0,0,0,0,0]
[]
[null,"Mantenimiento preventivo"]
[]
[null,"Seguro de Daños",0,0,0,0,0]
[]
[null,"Renta Total sin IVA",0,0,0,0,0]
[]
[null,"Renta Total con IVA",0,0,0,0,0]
[]
[null,"% de deducibilidad",0,0,0,0,0]
[null,null,{"$f":"Captura!K36","v":0},{"$f":"Captura!L36","v":0},{"$f":"Captura!M36","v":0},{"$f":"Captura!N36","v":0},{"$f":"Captura!O36","v":0}]
[]
[null,"PAGO INICIAL"]
[null,"Valores sin IVA"]
[null,"Anticipo",0,0,0,0,0]
[]
[null,"Comisión de apertura",0,0,0,0,0]
[]
[null,"Gestoría y registro",0,0,0,0,0]
[]
[null,"Seguro de daños *",0,0,0,0,0]
[]
[null,"Renta en depósito",0,0,0,0,0]
[]
[null,"Pago inicial sin IVA",0,0,0,0,0]
[]
[null,"Pago inicial con IVA",0,0,0,0,0]
[]
[null,"Valor residual",0,0,0,0,0]
[]
[null,"* Seguro del primer año"]
[]
["Notas:"]
["1. Esta cotización no es una autorización y no representa ninguna obligación para Leasing Mobile de México, S. A. de C. V."]
["2. La información descrita en el presente documento está sujeta a cambios sin previo aviso."]
["3. Esta cotización no considera gastos que el equipo requiera para su adquisición, uso o mantenimiento."]
["4. Las rentas en depósito serán devueltas al cumplimiento de todas las obligaciones contractauales del Arrendatario."]
["5. Esta cotización no incluye el costo de emplacamiento ni verificación vehicular"]

{"sheet":"Cotizador","index":1,"n_rows":93,"n_cols":7,"rows_kept":93,"cut":false,"hidden":false,"merged":[[6,2,6,3],[8,2,8,3],[10,2,10,3],[12,2,12,3],[16,2,17,3]]}
[null,"COTIZACIÓN DE ARRENDAMIENTO PURO"]
[null,null,null,null,null,"Folio"]
[null,null,null,null,null,"Fecha",{"$f":"TODAY()","v":"2026-03-04"}]
[]
[]
[null,null,null,null,"Régimen"]
[null,"Cliente",null,null,"Física AE"]
[]
[null,"Contacto"]
[]
[null,"Teléfono"]
[]
[null,"E-mail"]
[]
[null,"Tipo de vehículo","Vehículo utilitario"]
[]
[null,"Descripción del activo"]
[]
[]
[null,"Valor factura sin IVA",{"$f":"C24/1.16","v":0}]
[]
[null,"IVA",{"$f":"C20*0.16","v":0}]
[]
[null,"Valor factura con IVA"]
[]
[null,"Plazo (meses)",18,24,36,48,60]
[]
[]
[null,"Anticipo",0.15]
[]
[null,"Renta en depósito","Si"]
[]
[null,"Flotilla (5 autos o mas)","Si"]
[]
[null,"Residual",0.5,0.5,0,0,0]
[]
[null,"Seguro financiado","Si"]
[]
[null,"Seguro anual sin IVA",0]
[]
[null,"Comisión Referencia",{"$f":"GUÍA!C41","v":0.02}]
[]
[null,"Tipo de auto",1]
[]
[null,"Gasolina / Diesel",1]
[null,"Eléctrico / Híbrido",2]
[null,"Carga / Transporte",3]
[]
[null,null,18,24,36,48,60]
[null,"Valores sin IVA"]
[null,"Renta Mensual",{"$f":"IFERROR(Resumen!I27,0)","v":0},{"$f":"IFERROR(Resumen!J27,0)","v":0},{"$f":"IFERROR(Resumen!K27,0)","v":0},{"$f":"IFERROR(Resumen!L27,0)","v":0},{"$f":"IFERROR(Resumen!M27,0)","v":0}]
[]
[null,"GMOV ",{"$f":"IFERROR(Resumen!I28,0)","v":0},{"$f":"IFERROR(Resumen!J28,0)","v":0},{"$f":"IFERROR(Resumen!K28,0)","v":0},{"$f":"IFERROR(Resumen!L28,0)","v":0},{"$f":"IFERROR(Resumen!M28,0)","v":0}]
[]
[null,"GPS",{"$f":"IFERROR(Resumen!I29,0)","v":0},{"$f":"IFERROR(Resumen!J29,0)","v":0},{"$f":"IFERROR(Resumen!K29,0)","v":0},{"$f":"IFERROR(Resumen!L29,0)","v":0},{"$f":"IFERROR(Resumen!M29,0)","v":0}]
[]
[null,"Mantenimiento preventivo"]
[]
[null,"Seguro de Daños",{"$f":"IFERROR(Resumen!I30,0)","v":0},{"$f":"IFERROR(Resumen!J30,0)","v":0},{"$f":"IFERROR(Resumen!K30,0)","v":0},{"$f":"IFERROR(Resumen!L30,0)","v":0},{"$f":"IFERROR(Resumen!M30,0)","v":0}]
[]
[null,"Renta Total sin IVA",{"$f":"C51+C53+C55+C59","v":0},{"$f":"D51+D53+D55+D59","v":0},0,0,0]
[]
[null,"Renta Total con IVA",{"$f":"C61*1.16","v":0},{"$f":"D61*1.16","v":0},0,0,0]
[]
[null,"% de deducibilidad",{"$f":"Resumen!I25","v":0},{"$f":"Resumen!J25","v":0},{"$f":"Resumen!K25","v":0},{"$f":"Resumen!L25","v":0},{"$f":"Resumen!M25","v":0}]
[null,null,{"$f":"Captura!K36","v":0},{"$f":"Captura!L36","v":0},{"$f":"Captura!M36","v":0},{"$f":"Captura!N36","v":0},{"$f":"Captura!O36","v":0}]
[]
[null,"PAGO INICIAL"]
[null,"Valores sin IVA"]
[null,"Anticipo",{"$f":"Resumen!I34","v":0},{"$f":"Resumen!J34","v":0},{"$f":"Resumen!K34","v":0},{"$f":"Resumen!L34","v":0},{"$f":"Resumen!M34","v":0}]
[]
[null,"Comisión de apertura",{"$f":"Resumen!I35","v":0},{"$f":"Resumen!J35","v":0},{"$f":"Resumen!K35","v":0},{"$f":"Resumen!L35","v":0},{"$f":"Resumen!M35","v":0}]
[]
[null,"Gestoría y registro",{"$f":"Resumen!I36+Resumen!I37+Resumen!I38","v":0},{"$f":"Resumen!J36+Resumen!J37+Resumen!J38","v":0},{"$f":"Resumen!K36+Resumen!K37+Resumen!K38","v":0},{"$f":"Resumen!L36+Resumen!L37+Resumen!L38","v":0},{"$f":"Resumen!M36+Resumen!M37+Resumen!M38","v":0}]
[]
[null,"Seguro de daños *",{"$f":"Captura!K22","v":0},{"$f":"Captura!L22","v":0},{"$f":"Captura!M22","v":0},{"$f":"Captura!N22","v":0},{"$f":"Captura!O22","v":0}]
[]
[null,"Renta en depósito",{"$f":"Captura!K19","v":0},{"$f":"Captura!L19","v":0},{"$f":"Captura!M19","v":0},{"$f":"Captura!N19","v":0},{"$f":"Captura!O19","v":0}]
[]
[null,"Pago inicial sin IVA",{"$f":"C70+C72+C74+C76+C78","v":0},{"$f":"D70+D72+D74+D76+D78","v":0},{"$f":"E70+E72+E74+E76+E78","v":0},{"$f":"F70+F72+F74+F76+F78","v":0},{"$f":"G70+G72+G74+G76+G78","v":0}]
[]
[null,"Pago inicial con IVA",{"$f":"((C80-C78)*1.16)+C78","v":0},{"$f":"((D80-D78)*1.16)+D78","v":0},0,0,0]
[]
[null,"Valor residual",{"$f":"IFERROR(Resumen!I44,0)","v":0},{"$f":"IFERROR(Resumen!J44,0)","v":0},{"$f":"IFERROR(Resumen!K44,0)","v":0},{"$f":"IFERROR(Resumen!L44,0)","v":0},{"$f":"IFERROR(Resumen!M44,0)","v":0}]
[]
[null,"* Seguro del primer año"]
[]
["Notas:"]
["1. Esta cotización no es una autorización y no representa ninguna obligación para Leasing Mobile de México, S. A. de C. V."]
["2. La información descrita en el presente documento está sujeta a cambios sin previo aviso."]
["3. Esta cotización no considera gastos que el equipo requiera para su adquisición, uso o mantenimiento."]
["4. Las rentas en depósito serán devueltas al cumplimiento de todas las obligaciones contractauales del Arrendatario."]
["5. Esta cotización no incluye el costo de emplacamiento ni verificación vehicular"]

{"sheet":"Captura","index":2,"n_rows":64,"n_cols":27,"rows_kept":64,"cut":false,"hidden":true,"merged":[[40,1,40,3],[30,3,30,6],[31,3,31,6],[32,3,32,6],[27,1,27,3],[14,3,16,6],[2,13,2,14],[7,3,7,6],[6,3,6,6],[9,3,9,6],[8,3,8,6]]}
[]
[null,null,null,null,null,null,null,null,null,null,null,null,null,null,"Cotizador Arrendamiento Puro"]
[null,null,null,null,null,null,null,null,null,null,null,null,null,{"$f":"TODAY()","v":"2026-03-04"}]
[]
[null,null,null,null,null,null,null,null,"Full service tasa",null,0.1]
[null,"Solicitante",null,null,null,null,null,null,"Condiciones del arrendamiento",null,null,null,"Condiciones del fondeo",null,null,null,"No"]
[null,"Nombre",null,{"$f":"Cotizador!C7","v":0},null,null,null,null,"Tasa de interés activa",null,{"$f":"IF(Cotizador!$C$33=Captura!$Q$8,Captura!$Q$9,Captura!$Q$7)","v":0.26},null,"% de Fondeo",null,0.5,null,0.28000000000000003,"Tipo",2,{"$f":"VLOOKUP(S7,R8:S14,2,FALSE)","v":"Vehículo utilitario"}]
[null,"Atención",null,{"$f":"Cotizador!C9","v":0},null,null,null,null,"No. de rentas en depósito",null,{"$f":"IF(Cotizador!C31=Referencia!D3,0,1)","v":1},null,"Fondeo",null,{"$f":"+G20*O7-K10*C19","v":0},null,"Si",1,"Automóvil ejecutivo"]
[null,"Teléfono",null,{"$f":"Cotizador!C11","v":0},null,null,null,null,"Comisión de apertura",null,0.03,null,"Tasa de interés pasiva",null,0.16,null,0.26,2,"Vehículo utilitario"]
[null,"e-mail",null,{"$f":"Cotizador!C13","v":0},null,null,null,null,"Anticipo",null,{"$f":"G18*(L10)","v":0},{"$f":"Cotizador!$C$29","v":0.15},"Comisión de apertura",null,1.4999999999999999E-2,null,null,3,"Equipo de cómputo"]
[null,null,null,null,null,null,null,null,null,"VP de Flujos",{"$f":"+'Plazo 1'!AJ18+'Plazo 1'!AK18","v":{"$error":"#DIV/0!"}},{"$f":"+'Plazo 2'!AJ18+'Plazo 2'!AK18","v":{"$error":"#DIV/0!"}},{"$f":"+'Plazo 3'!AJ18+'Plazo 3'!AK18","v":{"$error":"#DIV/0!"}},{"$f":"+'Plazo 4'!AJ18+'Plazo 4'!AK18","v":{"$error":"#DIV/0!"}},{"$f":"+'Plazo 5'!AJ18+'Plazo 5'!AK18","v":{"$error":"#DIV/0!"}},null,null,4,"Equipo solar"]
[null,"Equipo a cotizar",null,null,null,null,null,null,"Resultados","Indicador Anualiz.",{"$f":"+'Plazo 1'!AK24","v":{"$error":"#DIV/0!"}},{"$f":"+'Plazo 2'!AK24","v":{"$error":"#DIV/0!"}},{"$f":"+'Plazo 3'!AK24","v":{"$error":"#DIV/0!"}},{"$f":"+'Plazo 4'!AK24","v":{"$error":"#DIV/0!"}},{"$f":"+'Plazo 5'!AK24","v":{"$error":"#DIV/0!"}},null,null,5,"Otro 1"]
[null,"Tipo de equipo",null,null,null,null,null,null,"Plazo en meses",null,18,24,36,48,60,null,null,6,"Otro 2"]
[null,"Estado del equipo",null,null,null,null,null,null,"Renta mensual",null,{"$f":"ROUNDUP(PMT($K$7/12,K13,-$G$18-$G$41+K17,K29),0)*R24","v":0},{"$f":"ROUNDUP(PMT($K$7/12,L13,-$G$18-$G$41+L17,L29),0)*S24","v":0},0,0,0,null,null,7,"Otro 2"]
[null,"Descripción",null,{"$f":"Cotizador!C17","v":0},null,null,null,null,"Factor",null,{"$f":"((K14*K13)+K10+K29)/G18*R24","v":{"$error":"#DIV/0!"}},{"$f":"((L14*L13)+K10+L29)/G18*S24","v":{"$error":"#DIV/0!"}},{"$f":"((M14*M13)+K10+M29)/G18*T24","v":{"$error":"#DIV/0!"}},{"$f":"((N14*N13)+K10+N29)/G18*U24","v":{"$error":"#DIV/0!"}},{"$f":"((O14*O13)+K10+O29)/G18*V24","v":{"$error":"#DIV/0!"}}]
[null,null,null,null,null,null,null,null,"Renta total",null,{"$f":"+K14","v":0},{"$f":"+L14","v":0},0,0,0]
[null,null,null,null,null,null,null,null,"Anticipo",null,{"$f":"+$K$10*R24","v":0},{"$f":"+$K$10*S24","v":0},{"$f":"+$K$10*T24","v":0},{"$f":"+$K$10*U24","v":0},{"$f":"+$K$10*V24","v":0},null,null,"Estado",1,{"$f":"VLOOKUP(S17,R18:S19,2,FALSE)","v":"Nuevo"}]
[null,"Valor factura sin IVA",null,null,null,null,{"$f":"Cotizador!$C$20","v":0},null,"Comisión de apertura",null,{"$f":"+$G$18*$K$9*R24","v":0},0,0,{"$f":"+$G$18*$K$9*U24","v":0},{"$f":"+$G$18*$K$9*V24","v":0},null,null,1,"Nuevo",null,null,null,{"$f":"W28*W27","v":0},{"$f":"X28*X27","v":0},0,0,0]
[null,"IVA",0.16,null,null,null,{"$f":"+G18*C19","v":0},null,"Rentas en depósito",null,{"$f":"+K14*$K$8*R24","v":0},{"$f":"+L14*$K$8*S24","v":0},{"$f":"+M14*$K$8*T24","v":0},{"$f":"+N14*$K$8*U24","v":0},{"$f":"+O14*$K$8*V24","v":0},null,null,2,"Usado"]
[null,"Valor factura con IVA",null,null,null,null,{"$f":"+G18+G19","v":0},null,"Gestoría y Registro",null,{"$f":"+$G$23*R24","v":0},{"$f":"+$G$23*S24","v":0},{"$f":"+$G$23*T24","v":0},{"$f":"+$G$23*U24","v":0},{"$f":"+$G$23*V24","v":0}]
[null,null,null,null,null,null,null,null,"Equipo de geolocalización",null,{"$f":"+$G$24*R24","v":0},{"$f":"+$G$24*S24","v":0},{"$f":"+$G$24*T24","v":0},{"$f":"+$G$24*U24","v":0},{"$f":"+$G$24*V24","v":0},null,null,"Plazo",null,null,null,null,"Renta adicional total"]
[null,"Accesorios - importes sin IVA",null,null,null,null,null,null,"Seguro de daños",null,{"$f":"IF($S$26=1,+$G$25*R24,0)","v":0},{"$f":"IF($S$26=1,+$G$25*S24,0)","v":0},{"$f":"IF($S$26=1,+$G$25*T24,0)","v":0},{"$f":"IF($S$26=1,+$G$25*U24,0)","v":0},{"$f":"IF($S$26=1,+$G$25*V24,0)","v":0},null,null,{"$f":"+K13","v":18},{"$f":"+L13","v":24},{"$f":"+M13","v":36},{"$f":"+N13","v":48},{"$f":"+O13","v":60},{"$f":"R22","v":18},{"$f":"S22","v":24},36,48,60]
[null,"Gestoría y Registro",null,null,null,"Pago único",2500,null,"Placas y Tenencia",null,{"$f":"IF($S$33=1,+$G$26*R24,0)","v":0},{"$f":"IF($S$33=1,+$G$26*S24,0)","v":0},{"$f":"IF($S$33=1,+$G$26*T24,0)","v":0},{"$f":"IF($S$33=1,+$G$26*U24,0)","v":0},{"$f":"IF($S$33=1,+$G$26*V24,0)","v":0},null,null,false,false,false,false,false,{"$f":"HLOOKUP(W22,W27:AA28,2,FALSE)+HLOOKUP(W22,W34:AA35,2,FALSE)+HLOOKUP(W22,W41:AA42,2,FALSE)","v":0},{"$f":"HLOOKUP(X22,W27:AA28,2,FALSE)+HLOOKUP(X22,W34:AA35,2,FALSE)+HLOOKUP(X22,W41:AA42,2,FALSE)","v":0},{"$f":"HLOOKUP(Y22,W27:AA28,2,FALSE)+HLOOKUP(Y22,W34:AA35,2,FALSE)+HLOOKUP(Y22,W41:AA42,2,FALSE)","v":0},{"$f":"HLOOKUP(Z22,W27:AA28,2,FALSE)+HLOOKUP(Z22,W34:AA35,2,FALSE)+HLOOKUP(Z22,W41:AA42,2,FALSE)","v":0},{"$f":"HLOOKUP(AA22,W27:AA28,2,FALSE)+HLOOKUP(AA22,W34:AA35,2,FALSE)+HLOOKUP(AA22,W41:AA42,2,FALSE)","v":0}]
[null,"Equipo de geolocalización",null,null,null,"Pago único",5000,null,"Servicio de geolocalización",null,{"$f":"IF($S$40=1,+$G$27*R24,0)","v":0},{"$f":"IF($S$40=1,+$G$27*S24,0)","v":0},{"$f":"IF($S$40=1,+$G$27*T24,0)","v":0},{"$f":"IF($S$40=1,+$G$27*U24,0)","v":0},{"$f":"IF($S$40=1,+$G$27*V24,0)","v":0},null,null,{"$f":"IF(R23=TRUE,1,0)","v":0},{"$f":"IF(S23=TRUE,1,0)","v":0},0,0,0]
[null,"Seguro de daños anual",null,null,null,null,{"$f":"Cotizador!$C$39","v":0},null,{"$f":"IF(B28=\"\",\"Otro\",+B28)","v":"Otro"},null,{"$f":"+$G$28*R24","v":0},{"$f":"+$G$28*S24","v":0},{"$f":"+$G$28*T24","v":0},{"$f":"+$G$28*U24","v":0},{"$f":"+$G$28*V24","v":0}]
[null,"Placas y Tenencia anual",null,null,null,null,null,null,"IVA",null,{"$f":"$C$19*SUM(K17:K18,K20:K22)","v":0},{"$f":"$C$19*SUM(L17:L18,L20:L22)","v":0},{"$f":"$C$19*SUM(M17:M18,M20:M22)","v":0},0,0,null,null,"Seguro de daños",{"$f":"IF(Cotizador!C37=Captura!T29,Captura!R29,Captura!R30)","v":2},{"$f":"VLOOKUP(S26,R29:S30,2,FALSE)","v":"Pago en renta"},null,null,"Rentas"]
[null,"GPS",null,null,null,null,380,null,"Desembolso inicial",null,{"$f":"SUM(K17:K22,K25:K26)","v":0},{"$f":"SUM(L17:L22,L25:L26)","v":0},{"$f":"SUM(M17:M22,M25:M26)","v":0},0,0,null,null,{"$f":"R22","v":18},{"$f":"S22","v":24},36,48,60,18,24,36,48,60]
[null,null,null,null,null,null,null,null,"Residual %",null,{"$f":"Cotizador!C35","v":0.5},{"$f":"Cotizador!D35","v":0.5},{"$f":"Cotizador!E35","v":0},{"$f":"Cotizador!F35","v":0},{"$f":"Cotizador!G35","v":0},null,null,{"$f":"+G25","v":0},{"$f":"+R28*(1+$D$35)","v":0},{"$f":"+S28*(1+$D$35)","v":0},{"$f":"+T28*(1+$D$35)","v":0},{"$f":"+U28*(1+$D$35)","v":0},{"$f":"IF($S26=$R30,PMT($K$5/12,R27,-(($R28/12)*W27)*R27/W27),0)","v":0},{"$f":"IF($S26=$R30,PMT($K$5/12,S27,-(($R28/12)*X27)*S27/X27),0)","v":0},0,0,0]
[null,null,null,null,null,null,null,null,"Residual sin IVA",null,{"$f":"+K28*$G$20*R24","v":0},{"$f":"+L28*$G$20*S24","v":0},{"$f":"+M28*$G$20*T24","v":0},{"$f":"+N28*$G$20*U24","v":0},{"$f":"+O28*$G$20*V24","v":0},null,null,1,"Pago anual","No"]
[null,"Ejecutivo LMM",null,null,null,null,null,null,"Pago de fondeo sin IVA",null,{"$f":"PMT($O$9/12,K13,-$O$8,K33)*R24","v":0},{"$f":"PMT($O$9/12,L13,-$O$8,L33)*S24","v":0},{"$f":"PMT($O$9/12,M13,-$O$8,M33)*T24","v":0},{"$f":"PMT($O$9/12,N13,-$O$8,N33)*U24","v":0},{"$f":"PMT($O$9/12,O13,-$O$8,O33)*V24","v":0},null,null,2,"Pago en renta","Si"]
[null,"Nombre",null,"xxxx",null,null,null,null,"Comisión de apertura sin IVA",null,{"$f":"+$G$20*$O$7*$O$10*R24","v":0},{"$f":"+$G$20*$O$7*$O$10*S24","v":0},{"$f":"+$G$20*$O$7*$O$10*T24","v":0},{"$f":"+$G$20*$O$7*$O$10*U24","v":0},{"$f":"+$G$20*$O$7*$O$10*V24","v":0},null,null,3,"Otro no habilitado"]
[null,"Teléfono",null,"xxxx",null,null,null,null,"Bullet payment %",null,0,0,0,0,0]
[null,"e-mail",null,"xxxx",null,null,null,null,"Bullet payment",null,{"$f":"+K32*$G$20*$O$7*R24","v":0},{"$f":"+L32*$G$20*$O$7*S24","v":0},{"$f":"+M32*$G$20*$O$7*T24","v":0},{"$f":"+N32*$G$20*$O$7*U24","v":0},{"$f":"+O32*$G$20*$O$7*V24","v":0},null,null,"Placas y Tenencia",1,{"$f":"VLOOKUP(S33,R36:S37,2,FALSE)","v":"Pago anual"},null,null,"Rentas"]
[null,null,null,null,null,null,null,null,"Capital requerido",null,{"$f":"+$G$20-K14-K17-K18-K19-$O$8","v":0},{"$f":"+$G$20-L14-L17-L18-L19-$O$8","v":0},{"$f":"+$G$20-M14-M17-M18-M19-$O$8","v":0},{"$f":"+$G$20-N14-N17-N18-N19-$O$8","v":0},{"$f":"+$G$20-O14-O17-O18-O19-$O$8","v":0},null,null,{"$f":"R22","v":18},{"$f":"S22","v":24},36,48,60,18,24,36,48,60]
[null,"Tasa para VP",null,0.04,null,null,null,null,"resumen",null,"detalle","detalle","detalle","detalle","detalle",null,null,{"$f":"+G26","v":0},{"$f":"+R35*(1+$D$35)","v":0},{"$f":"+S35*(1+$D$35)","v":0},{"$f":"+T35*(1+$D$35)","v":0},{"$f":"+U35*(1+$D$35)","v":0},{"$f":"IF($S33=$R37,PMT($K$5/12,R34,-$R35*R34/W34),0)","v":0},{"$f":"IF($S33=$R37,PMT($K$5/12,S34,-$R35*S34/X34),0)","v":0},0,0,0]
[null,null,null,null,null,null,null,null,"Evaluación",null,{"$f":"IF(R24=0,0,'Plazo 1'!AK24)","v":0},{"$f":"IF(S24=0,0,'Plazo 2'!AK24)","v":0},{"$f":"IF(T24=0,0,'Plazo 3'!AK24)","v":0},{"$f":"IF(U24=0,0,'Plazo 4'!AK24)","v":0},{"$f":"IF(V24=0,0,'Plazo 5'!AK24)","v":0},null,null,1,"Pago anual"]
[null,null,null,null,null,null,null,null,"Flujo de rentas vs fondeo",null,{"$f":"IF(K14-K30>=0,\"Positivo\",\"Negativo\")","v":"Positivo"},{"$f":"IF(L14-L30>=0,\"Positivo\",\"Negativo\")","v":"Positivo"},{"$f":"IF(M14-M30>=0,\"Positivo\",\"Negativo\")","v":"Positivo"},{"$f":"IF(N14-N30>=0,\"Positivo\",\"Negativo\")","v":"Positivo"},{"$f":"IF(O14-O30>=0,\"Positivo\",\"Negativo\")","v":"Positivo"},null,null,2,"Pago en renta"]
[null,null,null,null,null,null,null,null,null,null,null,null,null,null,null,null,null,3,"Otro no habilitado"]
[]
[null,null,null,null,null,null,null,null,null,null,null,null,null,null,"v. 20240220",null,null,"GPS y Servicios",1,{"$f":"VLOOKUP(S40,R43:S44,2,FALSE)","v":"Pago anual"},null,null,"Rentas"]
[null,"Referencia",null,null,null,{"$f":"Cotizador!$C$41","v":0.02},{"$f":"F41*G18","v":0},null,"% Administración de flotilla",null,1.2999999999999999E-2,null,null,null,null,null,null,{"$f":"R22","v":18},{"$f":"S22","v":24},36,48,60,18,24,36,48,60]
[null,null,null,null,null,"Poner % correspondiente",null,null,"Tipo de auto",null,{"$f":"Cotizador!C43","v":1},null,null,null,null,null,null,{"$f":"+G27","v":380},{"$f":"+R42*(1+$D$35)","v":395.2},{"$f":"+S42*(1+$D$35)","v":411.00799999999998},{"$f":"+T42*(1+$D$35)","v":427.44831999999997},{"$f":"+U42*(1+$D$35)","v":444.54625279999999},{"$f":"IF($S40=$R44,PMT($K$5/12,R41,-$R42*R41/W41),0)","v":0},{"$f":"IF($S40=$R44,PMT($K$5/12,S41,-$R42*S41/X41),0)","v":0},0,0,0]
[null,null,null,null,null,null,null,null,"Gasolina / Diesel",1,null,null,null,null,null,null,null,1,"Pago anual"]
[null,null,null,null,null,null,null,null,"Eléctrico / Híbrido",2,null,null,{"$f":"4804.38+4152+22500+8283.42","v":39739.800000000003},null,null,null,null,2,"Pago en renta"]
[null,null,null,null,null,null,null,null,"Carga / Transporte",3,null,null,null,null,null,null,null,3,"Otro no habilitado"]
[]
[null,null,null,null,null,null,null,null,"Gastos de gestion de Mantenimiento y obligaciones vehiculares (GMOV)",null,{"$f":"IF(K15=0,0,$G$18*$K$41)","v":{"$error":"#DIV/0!"}},{"$error":"#DIV/0!"},{"$error":"#DIV/0!"},{"$error":"#DIV/0!"},{"$f":"IF(O15=0,0,$G$18*$K$41)","v":{"$error":"#DIV/0!"}}]
[null,null,null,null,null,null,null,null,"Renta sin GMOV",null,{"$f":"K14-K47","v":{"$error":"#DIV/0!"}},{"$f":"L14-L47","v":{"$error":"#DIV/0!"}},{"$error":"#DIV/0!"},{"$error":"#DIV/0!"},{"$error":"#DIV/0!"}]
[]
[null,null,null,null,null,null,null,null,"Límite deducible mensual"]
[null,null,null,null,null,null,null,null,"Gasolina / Diesel",null,{"$f":"IF(K15=0,0,Deducible!$D$2)","v":{"$error":"#DIV/0!"}},{"$f":"IF(L15=0,0,Deducible!$D$2)","v":{"$error":"#DIV/0!"}},{"$f":"IF(M15=0,0,Deducible!$D$2)","v":{"$error":"#DIV/0!"}},{"$f":"IF(N15=0,0,Deducible!$D$2)","v":{"$error":"#DIV/0!"}},{"$f":"IF(O15=0,0,Deducible!$D$2)","v":{"$error":"#DIV/0!"}}]
[null,null,null,null,null,null,null,null,"% de deducibilidad",null,{"$f":"IFERROR(IF(K51>K48,100%,K51/K48),0)","v":0},{"$f":"IFERROR(IF(L51>L48,100%,L51/L48),0)","v":0},0,0,0]
[null,null,null,null,null,null,null,null,"Eléctrico / Híbrido",null,{"$f":"IF(K15=0,0,Deducible!$D$3)","v":{"$error":"#DIV/0!"}},{"$f":"IF(L15=0,0,Deducible!$D$3)","v":{"$error":"#DIV/0!"}},{"$f":"IF(M15=0,0,Deducible!$D$3)","v":{"$error":"#DIV/0!"}},{"$f":"IF(N15=0,0,Deducible!$D$3)","v":{"$error":"#DIV/0!"}},{"$f":"IF(O15=0,0,Deducible!$D$3)","v":{"$error":"#DIV/0!"}}]
[null,null,null,null,null,null,null,null,"% de deducibilidad",null,{"$f":"IFERROR(IF(K53>K48,100%,K53/K48),0)","v":0},{"$f":"IFERROR(IF(L53>L48,100%,L53/L48),0)","v":0},0,0,0]
[null,null,null,null,null,null,null,null,"Carga / Transporte",null,{"$f":"K48","v":{"$error":"#DIV/0!"}},{"$error":"#DIV/0!"},{"$error":"#DIV/0!"},{"$error":"#DIV/0!"},{"$error":"#DIV/0!"}]
[null,null,null,null,null,null,null,null,null,null,{"$f":"IFERROR(IF(K55>K48,100%,K55/K48),0)","v":0},{"$f":"IFERROR(IF(L55>L48,100%,L55/L48),0)","v":0},0,0,0]
[]
[]
[null,null,null,null,null,null,null,null,"GMOV",null,{"$f":"IFERROR(K47/K14,0)","v":0},{"$f":"IFERROR(L47/L14,0)","v":0},0,{"$f":"IFERROR(N47/N14,0)","v":0},0]
[null,null,null,null,null,null,null,null,"Renta ajustada",null,{"$f":"IFERROR(K48/K14,0)","v":0},{"$f":"IFERROR(L48/L14,0)","v":0},0,0,0]
[null,null,null,null,null,null,null,null,"Deducibilidad"]
[null,null,null,null,null,null,null,null,"Gasolina / Diesel",1,{"$f":"(K$59*1)+(K$60*K52)","v":0},{"$f":"(L$59*1)+(L$60*L52)","v":0},0,0,0]
[null,null,null,null,null,null,null,null,"Eléctrico / Híbrido",2,{"$f":"(K$59*1)+(K$60*K54)","v":0},{"$f":"(L$59*1)+(L$60*L54)","v":0},0,0,0]
[null,null,null,null,null,null,null,null,"Carga / Transporte",3,{"$f":"(K$59*1)+(K$60*K56)","v":0},{"$f":"(L$59*1)+(L$60*L56)","v":0},0,0,0]

{"sheet":"Resumen","index":3,"n_rows":87,"n_cols":13,"rows_kept":87,"cut":false,"hidden":true,"merged":[[6,1,6,12],[7,1,7,12],[9,11,9,12],[13,9,13,12],[14,9,14,12],[44,6,45,12],[32,6,32,12],[18,1,18,12],[22,4,25,5],[22,6,22,12],[23,6,23,7],[84,6,84,8],[84,10,84,12],[84,1,84,3],[82,1,82,3],[82,6,82,8],[82,10,82,12]]}
[]
[]
[]
[]
[]
[]
[null,"Cotización"]
[null,"Arrendamiento Puro"]
[]
[null,null,null,null,null,null,null,null,null,null,null,{"$f":"+Captura!N3","v":"2026-03-04"}]
[]
[]
[]
[null,"Cliente:",null,null,{"$f":"+Captura!D7","v":0},null,null,null,"Teléfono",{"$f":"+Captura!D9","v":0}]
[null,"Atención:",null,null,{"$f":"+Captura!D8","v":0},null,null,null,"E-mail",{"$f":"+Captura!D10","v":0}]
[]
[]
[null,null,null,null,null,null,null,null,null,null,null,null,{"$f":"+Captura!O40","v":"v. 20240220"}]
[]
[]
[null,"Tipo de equipo",null,null,{"$f":"+Captura!T7","v":"Vehículo utilitario"},null,null,null,null,null,null,null,"Regresar"]
[null,"Estado del equipo",null,null,{"$f":"+Captura!T17","v":"Nuevo"}]
[null,"Descripción",null,null,{"$f":"+Captura!D15","v":0},null,"RENTAS/MESES    "]
[null,null,null,null,null,null,"Factor interno",null,{"$f":"Captura!K15","v":{"$error":"#DIV/0!"}},{"$f":"Captura!L15","v":{"$error":"#DIV/0!"}},{"$f":"Captura!M15","v":{"$error":"#DIV/0!"}},{"$f":"Captura!N15","v":{"$error":"#DIV/0!"}},{"$f":"Captura!O15","v":{"$error":"#DIV/0!"}}]
[null,null,null,null,null,null,"% de Deducibilidad",null,{"$f":"SUMIF(Captura!$J$62:$J$64,Captura!$K$42,Captura!K62:K64)","v":0},{"$f":"SUMIF(Captura!$J$62:$J$64,Captura!$K$42,Captura!L62:L64)","v":0},{"$f":"SUMIF(Captura!$J$62:$J$64,Captura!$K$42,Captura!M62:M64)","v":0},{"$f":"SUMIF(Captura!$J$62:$J$64,Captura!$K$42,Captura!N62:N64)","v":0},{"$f":"SUMIF(Captura!$J$62:$J$64,Captura!$K$42,Captura!O62:O64)","v":0}]
[null,null,null,null,null,null,null,null,{"$f":"+Captura!K13","v":18},{"$f":"+Captura!L13","v":24},{"$f":"+Captura!M13","v":36},{"$f":"+Captura!N13","v":48},{"$f":"+Captura!O13","v":60}]
[null,"Valor factura sin IVA",null,null,{"$f":"+Captura!G18","v":0},null,"Renta mensual s/IVA",null,{"$f":"Captura!K48","v":{"$error":"#DIV/0!"}},{"$f":"Captura!L48","v":{"$error":"#DIV/0!"}},{"$f":"Captura!M48","v":{"$error":"#DIV/0!"}},{"$f":"Captura!N48","v":{"$error":"#DIV/0!"}},{"$f":"Captura!O48","v":{"$error":"#DIV/0!"}}]
[null,null,null,null,null,null,"GMOV",null,{"$f":"Captura!K47","v":{"$error":"#DIV/0!"}},{"$f":"Captura!L47","v":{"$error":"#DIV/0!"}},{"$f":"Captura!M47","v":{"$error":"#DIV/0!"}},{"$f":"Captura!N47","v":{"$error":"#DIV/0!"}},{"$f":"Captura!O47","v":{"$error":"#DIV/0!"}}]
[null,"IVA",null,null,{"$f":"+Captura!G19","v":0},null,"Servicio Geolocalización",null,{"$f":"IF(I24=0,0,Captura!K24)","v":{"$error":"#DIV/0!"}},{"$f":"IF(J24=0,0,Captura!L24)","v":{"$error":"#DIV/0!"}},{"$f":"IF(K24=0,0,Captura!M24)","v":{"$error":"#DIV/0!"}},{"$f":"IF(L24=0,0,Captura!N24)","v":{"$error":"#DIV/0!"}},{"$f":"IF(M24=0,0,Captura!O24)","v":{"$error":"#DIV/0!"}}]
[null,"Valor factura con IVA",null,null,{"$f":"+Captura!G20","v":0},null,"Seguro de daños",null,{"$f":"IF(I27=0,0,Captura!W28)","v":{"$error":"#DIV/0!"}},{"$f":"IF(J27=0,0,Captura!X28)","v":{"$error":"#DIV/0!"}},{"$f":"IF(K27=0,0,Captura!Y28)","v":{"$error":"#DIV/0!"}},{"$f":"IF(L27=0,0,Captura!Z28)","v":{"$error":"#DIV/0!"}},{"$f":"IF(M27=0,0,Captura!AA28)","v":{"$error":"#DIV/0!"}}]
[null,null,null,null,null,null,"Renta mensual s/IVA",null,{"$f":"SUM(I27:I30)","v":{"$error":"#DIV/0!"}},{"$f":"SUM(J27:J30)","v":{"$error":"#DIV/0!"}},{"$f":"SUM(K27:K30)","v":{"$error":"#DIV/0!"}},{"$f":"SUM(L27:L30)","v":{"$error":"#DIV/0!"}},{"$f":"SUM(M27:M30)","v":{"$error":"#DIV/0!"}}]
[null,null,null,null,null,null,"Renta mensual total",null,{"$f":"I31*1.16","v":{"$error":"#DIV/0!"}},{"$f":"J31*1.16","v":{"$error":"#DIV/0!"}},{"$f":"K31*1.16","v":{"$error":"#DIV/0!"}},{"$f":"L31*1.16","v":{"$error":"#DIV/0!"}},{"$f":"M31*1.16","v":{"$error":"#DIV/0!"}}]
[null,null,null,null,null,null,"PAGO INICIAL"]
[null,"No. de rentas en depósito",null,null,{"$f":"+Captura!K8","v":1},null,"Anticipo",null,{"$f":"+Captura!K17","v":0},{"$f":"+Captura!L17","v":0},{"$f":"+Captura!M17","v":0},{"$f":"+Captura!N17","v":0},{"$f":"+Captura!O17","v":0}]
[null,"Comisión de apertura",null,null,{"$f":"+Captura!K9","v":0.03},null,"Comisión de apertura",null,{"$f":"+Captura!K18","v":0},{"$f":"+Captura!L18","v":0},{"$f":"+Captura!M18","v":0},{"$f":"+Captura!N18","v":0},{"$f":"+Captura!O18","v":0}]
[null,"Anticipo",null,null,{"$f":"+Captura!K10","v":0},null,"Gestoría y Registro",null,{"$f":"+Captura!K20","v":0},{"$f":"+Captura!L20","v":0},{"$f":"+Captura!M20","v":0},{"$f":"+Captura!N20","v":0},{"$f":"+Captura!O20","v":0}]
[null,null,null,null,null,null,"Equipo de geo localización",null,{"$f":"+Captura!K21","v":0},{"$f":"+Captura!L21","v":0},{"$f":"+Captura!M21","v":0},{"$f":"+Captura!N21","v":0},{"$f":"+Captura!O21","v":0}]
[null,null,null,null,null,null,"Placas y Tenencia",null,{"$f":"+Captura!K23","v":0},{"$f":"+Captura!L23","v":0},{"$f":"+Captura!M23","v":0},{"$f":"+Captura!N23","v":0},{"$f":"+Captura!O23","v":0}]
[null,null,null,null,null,null,{"$f":"+Captura!I25","v":"Otro"},null,{"$f":"+Captura!K25","v":0},{"$f":"+Captura!L25","v":0},{"$f":"+Captura!M25","v":0},{"$f":"+Captura!N25","v":0},{"$f":"+Captura!O25","v":0}]
[null,"Gestoría y Registro",null,null,{"$f":"+Captura!F23","v":"Pago único"},null,"IVA",null,{"$f":"+Captura!K26","v":0},{"$f":"+Captura!L26","v":0},{"$f":"+Captura!M26","v":0},{"$f":"+Captura!N26","v":0},{"$f":"+Captura!O26","v":0}]
[null,"Equipo de geolocalización",null,null,{"$f":"+Captura!F24","v":"Pago único"},null,"Pago inicial",null,{"$f":"I43-I42","v":0},{"$f":"J43-J42","v":0},0,{"$f":"L43-L42","v":0},0]
[null,"Seguro de daños",null,null,{"$f":"+Captura!T26","v":"Pago en renta"},null,"Rentas en depósito",null,{"$f":"+Captura!K19","v":0},{"$f":"+Captura!L19","v":0},{"$f":"+Captura!M19","v":0},{"$f":"+Captura!N19","v":0},{"$f":"+Captura!O19","v":0}]
[null,"Placas y Tenencia",null,null,{"$f":"+Captura!T33","v":"Pago anual"},null,"Pago Total inicial",null,{"$f":"Captura!K27","v":0},{"$f":"Captura!L27","v":0},{"$f":"Captura!M27","v":0},{"$f":"Captura!N27","v":0},{"$f":"Captura!O27","v":0}]
[null,"Servicio de geolocalización",null,null,"Pago mensual",null,"Residual s/IVA",null,{"$f":"IF(I24=0,0,Captura!$G$18*Captura!K28)","v":{"$error":"#DIV/0!"}},{"$f":"IF(J24=0,0,Captura!$G$18*Captura!L28)","v":{"$error":"#DIV/0!"}},{"$f":"IF(K24=0,0,Captura!$G$18*Captura!M28)","v":{"$error":"#DIV/0!"}},{"$f":"IF(L24=0,0,Captura!$G$18*Captura!N28)","v":{"$error":"#DIV/0!"}},{"$f":"IF(M24=0,0,Captura!$G$18*Captura!O28)","v":{"$error":"#DIV/0!"}}]
[null,{"$f":"+Captura!I25","v":"Otro"},null,null,{"$f":"+Captura!F28","v":0},null,"No incluye seguro anual, placas y tenencia.\nPago inicial NO incluye renta 1. Las rentas en depósito NO se incluyen en la factura inicial, se otorga recibo."]
[]
[]
[]
[null,"Notas:"]
[null,"1. Esta cotización no es una autorización y no representa ninguna obligación para Leasing Mobile de México, S. A. de C. V."]
[null,"2. La información descrita en el presente documento está sujeta a cambios sin previo aviso."]
[null,"3. Esta cotización no considera gastos que el equipo requiera para su adquisición, uso o mantenimiento."]
[null,"4. Las rentas en depósito serán devueltas al cumplimiento de todas las obligaciones contractauales del Arrendatario."]
[]
[]
[]
[]
[null,"Documentación requerida:"]
[]
[null,1,"Copia de Acta Constitutiva de la empresa y poder (es) del Rep. Legal"]
[null,2,"Información Financiera (últimos 3 años)"]
[null,3,"Comprobante de domicilio con antigüedad no mayor a 3 meses"]
[null,null,null," - Recibo de teléfono fijo."]
[null,null,null," - Estado de cuenta bancario."]
[null,null,null," - Recibo de luz, agua o predial."]
[null,4,"Registro Federal de Contribuyentes."]
[null,5,"Identificación oficial vigente"]
[null,null,null," - Credencial de elector."]
[null,null,null," - Pasaporte."]
[null,null,null," - FM2."]
[null,6,"Buró de crédito de la empresa y principales accionistas."]
[null,7,"Solicitud firmada."]
[]
[]
[]
[]
[]
[]
[]
[]
[]
[]
[]
[null," "]
[null,"DIRECTIVO LEASING MOBILE",null,null,null,null,{"$f":"Captura!D31","v":"xxxx"},null,null,null,{"$f":"Captura!D8","v":0}]
[null,null,null,null,null,null,null,{"$f":"Captura!D32","v":"xxxx"}]
[null,null,null,null,null,null,null,{"$f":"Captura!D33","v":"xxxx"}]

{"sheet":"Deducible","index":4,"n_rows":22,"n_cols":6,"rows_kept":22,"cut":false,"hidden":true,"merged":[]}
[null,null,"Diario","Mensual","Anual"]
["Gasolina / Diesel",1,200,{"$f":"E2/12","v":6000},{"$f":"C2*360","v":72000}]
["Eléctrico / Híbrido",2,285,{"$f":"E3/12","v":8550},{"$f":"C3*360","v":102600}]
["Carga / Transporte",3,null,null,null,"100% deducible"]
[]
[]
[]
[]
[]
[]
[]
[]
[]
[]
[]
[null,"gmdo","Seguro","Renta","Mensual"]
[{"$f":"450000/1.16","v":387931.03448275867},5063,1729.24,5588.71,{"$f":"B17+C17+D17","v":12380.95},{"$f":"E17*1.16","v":14361.902}]
[null,{"$f":"B17/A17","v":1.3051288888888887E-2},null,null,null,{"$f":"Resumen!L32","v":{"$error":"#DIV/0!"}}]
[null,null,null,null,null,{"$f":"F18-F17","v":{"$error":"#DIV/0!"}}]
[]
[]
[null,null,null,{"$f":"(B17+D17)*36","v":383461.55999999994}]

{"sheet":"Referencia","index":5,"n_rows":12,"n_cols":7,"rows_kept":12,"cut":false,"hidden":true,"merged":[]}
["Tipo de activo","Plazo","Anticipo","Flotilla","Residual","Tipo","Persona"]
["Vehículo utilitario",18,0,"Si",0,1,"Moral"]
["Automóvil ejecutivo",24,0.05,"No",0.05,2,"Física AE"]
["Camiones",36,0.1,null,0.1,3]
[null,48,0.12,null,0.15]
[null,null,0.15,null,0.2]
[null,null,0.2,null,0.25]
[null,null,0.25,null,0.3]
[null,null,0.3,null,0.35]
[null,null,null,null,0.4]
[null,null,null,null,0.45]
[null,null,null,null,0.5]

{"sheet":"Plazo 1","index":6,"n_rows":111,"n_cols":37,"rows_kept":111,"cut":false,"hidden":true,"merged":[[16,35,16,36],[18,35,18,36],[109,1,109,16],[110,1,110,16],[12,10,12,16],[14,1,14,16],[18,4,20,5],[17,16,19,16],[106,1,106,16],[107,1,107,16],[108,1,108,16],[21,4,21,5],[22,4,22,5],[23,4,23,5],[112,1,112,17],[3,15,3,16],[6,1,6,16],[7,1,7,16],[9,15,9,16],[11,10,11,16]]}
[]
[]
[]
[]
[]
[]
[null,"Cotización"]
[null,"Arrendamiento Puro"]
[]
[null,null,null,null,null,null,null,null,null,null,null,null,null,null,null,{"$f":"+Captura!N3","v":"2026-03-04"}]
[]
[null,"Cliente:",null,null,{"$f":"+Captura!D7","v":0},null,null,null,null,"Teléfono",{"$f":"+Captura!D9","v":0}]
[null,"Atención:",null,null,{"$f":"+Captura!D8","v":0},null,null,null,null,"E-mail",{"$f":"+Captura!D10","v":0}]
[null,null,null,null,null,null,null,null,null,null,null,null,null,null,null,null,{"$f":"+Captura!O40","v":"v. 20240220"}]
[]
[]
[null,"Tipo de equipo",null,null,{"$f":"+Captura!T7","v":"Vehículo utilitario"},null,null,"Plazo del arrendamiento",null,{"$f":"+Captura!K13","v":18},null,"Gestoría y Registro",null,{"$f":"+Captura!F23","v":"Pago único"},null,null,null,null,null,null,null,null,null,null,null,null,null,null,null,null,null,null,null,null,null,"Valor presente de flujos"]
[null,"Estado del equipo",null,null,{"$f":"+Captura!T17","v":"Nuevo"},null,null,"No. de rentas en depósito",null,{"$f":"+Captura!K8","v":1},null,"Equipo de geolocalizacióon",null,{"$f":"+Captura!F24","v":"Pago único"},null,null,{"$f":"+Captura!K36","v":0},null,null,null,null,null,null,null,null,null,null,null,null,null,null,null,null,null,null,{"$f":"NPV(Captura!$D$35/12,AJ29:AJ88)+AJ28","v":{"$error":"#DIV/0!"}},{"$f":"NPV(Captura!$D$35/12,AK29:AK88)+AK28","v":-759.72924467997132}]
[null,"Descripción",null,null,{"$f":"+Captura!D15","v":0},null,null,"Comisión de apertura",null,{"$f":"+Captura!K9","v":0.03},null,"Seguro de daños",null,{"$f":"+Captura!T26","v":"Pago en renta"},null,null,null,null,null,null,null,null,null,null,null,null,null,null,null,null,null,null,null,null,null,"Tasa Interna de Retorno"]
[null,null,null,null,null,null,null,"Anticipo",null,{"$f":"+Captura!K10","v":0},null,"Placas y Tenencia",null,{"$f":"+Captura!T33","v":"Pago anual"},null,null,null,null,null,null,null,null,null,null,null,null,null,null,null,null,null,null,null,null,null,{"$f":"IRR(AJ28:AJ88,0.01)*12","v":{"$error":"#VALUE!"}},{"$f":"IRR(AK28:AK88,0.01)*12","v":{"$error":"#DIV/0!"}}]
[null,null,null,null,null,null,null,"Residual estimado",null,"Valor mercado",null,"Servicio de geolocalización",null,{"$f":"+Captura!T40","v":"Pago anual"},null,null,{"$f":"+Captura!K37","v":"Positivo"},null,null,null,null,null,null,null,null,null,null,null,null,null,null,null,null,null,null,"Capital Req.",{"$f":"+Captura!K34","v":0}]
[null,"Valor factura sin IVA",null,null,{"$f":"+Captura!G18","v":0},null,null,null,null,null,null,{"$f":"+Captura!I25","v":"Otro"},null,{"$f":"+Captura!F28","v":0},null,null,null,null,null,null,null,null,null,null,null,null,null,null,null,null,null,null,null,null,null,"VP / CR",{"$f":"+(AJ18+AK18)/AK21","v":{"$error":"#DIV/0!"}}]
[null,"IVA",null,null,{"$f":"+Captura!G19","v":0},null,null,null,null,null,null,null,null,null,null,null,"Regresar"]
[null,"Valor factua con IVA",null,null,{"$f":"+Captura!G20","v":0},null,null,null,null,null,null,null,null,null,null,null,null,null,null,null,null,null,null,null,null,null,null,null,null,null,null,null,null,null,null,"Indicador anualizado",{"$f":"+AK22/J17*12","v":{"$error":"#DIV/0!"}}]
[]
[null,"Periodo","Mes","Renta","Anticipo","Comisión de apertura","Rentas en depósito","Devolución de rentas en depósito","Gestoría y Registro","Equipo de geo localización","Seguro de daños","Placas y Tenencia","Servicio de geo localización",{"$f":"+L22","v":"Otro"},"Residual estimado","IVA","TOTAL",null,null,"Mes","Periodo","Fondeo","Comisión de apertura","Intereses","Capital","Pago","Bullet","Equipo de geo localización","Seguro de daños","Placas y Tenencia","Servicio de geo localización","Otro","IVA","TOTAL",null,"Flujo Activo sin IVA","Flujo Pasivo sin IVA"]
[]
[null,0,{"$f":"+P10","v":"2026-03-04"},{"$f":"+Captura!K16+Resumen!I29+Resumen!I30","v":{"$error":"#DIV/0!"}},{"$f":"+Captura!K10","v":0},{"$f":"+Captura!K18","v":0},{"$f":"+Captura!K19","v":0},{"$f":"IF(B28=J$17,-G$28,0)","v":0},{"$f":"+Captura!K20","v":0},{"$f":"+Captura!K21","v":0},{"$f":"+Captura!K22","v":0},{"$f":"+Captura!K23","v":0},{"$f":"+Captura!K24","v":0},{"$f":"+Captura!K25","v":0},{"$f":"IF(B28=J$17,Captura!$K$29,0)","v":0},{"$f":"SUM(D28:F28,I28:N28)*Captura!$C$19","v":{"$error":"#DIV/0!"}},{"$f":"SUM(D28:P28)-O28","v":{"$error":"#DIV/0!"}},null,null,1,{"$f":"+B28","v":0},{"$f":"+Captura!O8","v":0},{"$f":"+Captura!K31","v":0},null,null,null,null,{"$f":"+J28","v":0},{"$f":"+Captura!G25","v":0},{"$f":"+Captura!G26","v":0},{"$f":"+Captura!G27","v":380},{"$f":"+N28","v":0},{"$f":"+(W28+AB28+AC28+AD28+AE28+AF28)*Captura!$C$19","v":60.800000000000004},{"$f":"SUM(W28,Z28:AG28)","v":440.8},null,{"$f":"-E22+(Q28-P28)+O28","v":{"$error":"#DIV/0!"}},{"$f":"+V28-(AH28-AG28)","v":-380}]
[null,1,{"$f":"EDATE(C28,1)","v":"2026-04-04"},{"$f":"IF(B29<J$17,Captura!$K$16,0)+Resumen!$I$29+Resumen!$I$30","v":{"$error":"#DIV/0!"}},null,null,null,0,null,null,0,0,0,null,{"$f":"IF(B29=J$17,Captura!$K$29,0)","v":0},{"$f":"SUM(D29:F29,I29:N29)*Captura!$C$19","v":{"$error":"#DIV/0!"}},{"$f":"SUM(D29:P29)-O29","v":{"$error":"#DIV/0!"}},null,null,{"$f":"IF(T28=12,1,T28+1)","v":2},{"$f":"+B29","v":1},{"$f":"+V28-Y29-AA29","v":0},null,{"$f":"+V28*Captura!$O$9/12","v":0},{"$f":"+Z29-X29","v":0},{"$f":"+Captura!K30","v":0},{"$f":"IF(U29=J$17,Captura!$K$33,0)","v":0},null,0,0,0,null,{"$f":"+(W29+AB29+AC29+AD29+AE29+AF29)*Captura!$C$19","v":0},{"$f":"SUM(W29,Z29:AG29)","v":0},null,{"$f":"Q29-P29+O29","v":{"$error":"#DIV/0!"}},{"$f":"-(AH29-AG29)","v":0}]
[null,2,{"$f":"EDATE(C29,1)","v":"2026-05-04"},{"$f":"IF(B30<J$17,Captura!$K$16,0)+Resumen!$I$29+Resumen!$I$30","v":{"$error":"#DIV/0!"}},null,null,null,0,null,null,0,0,0,null,{"$f":"IF(B30=J$17,Captura!$K$29,0)","v":0},{"$f":"SUM(D30:F30,I30:N30)*Captura!$C$19","v":{"$error":"#DIV/0!"}},{"$error":"#DIV/0!"},null,null,{"$f":"IF(T29=12,1,T29+1)","v":3},2,{"$f":"+V29-Y30-AA30","v":0},null,{"$f":"+V29*Captura!$O$9/12","v":0},{"$f":"+Z30-X30","v":0},{"$f":"IF(U30>J$17,0,Z29)","v":0},{"$f":"IF(U30=J$17,Captura!$K$33,0)","v":0},null,0,0,0,null,{"$f":"+(W30+AB30+AC30+AD30+AE30+AF30)*Captura!$C$19","v":0},0,null,{"$f":"Q30-P30+O30","v":{"$error":"#DIV/0!"}},{"$f":"-(AH30-AG30)","v":0}]
[null,3,"2026-06-04",{"$f":"IF(B31<J$17,Captura!$K$16,0)+Resumen!$I$29+Resumen!$I$30","v":{"$error":"#DIV/0!"}},null,null,null,0,null,null,0,0,0,null,{"$f":"IF(B31=J$17,Captura!$K$29,0)","v":0},{"$f":"SUM(D31:F31,I31:N31)*Captura!$C$19","v":{"$error":"#DIV/0!"}},{"$error":"#DIV/0!"},null,null,4,3,0,null,{"$f":"+V30*Captura!$O$9/12","v":0},0,{"$f":"IF(U31>J$17,0,Z30)","v":0},{"$f":"IF(U31=J$17,Captura!$K$33,0)","v":0},null,0,0,0,null,{"$f":"+(W31+AB31+AC31+AD31+AE31+AF31)*Captura!$C$19","v":0},0,null,{"$error":"#DIV/0!"},0]
[null,4,"2026-07-04",{"$f":"IF(B32<J$17,Captura!$K$16,0)+Resumen!$I$29+Resumen!$I$30","v":{"$error":"#DIV/0!"}},null,null,null,0,null,null,0,0,0,null,{"$f":"IF(B32=J$17,Captura!$K$29,0)","v":0},{"$f":"SUM(D32:F32,I32:N32)*Captura!$C$19","v":{"$error":"#DIV/0!"}},{"$error":"#DIV/0!"},null,null,5,4,0,null,{"$f":"+V31*Captura!$O$9/12","v":0},0,0,{"$f":"IF(U32=J$17,Captura!$K$33,0)","v":0},null,0,0,0,null,{"$f":"+(W32+AB32+AC32+AD32+AE32+AF32)*Captura!$C$19","v":0},0,null,{"$error":"#DIV/0!"},0]
[null,5,"2026-08-04",{"$f":"IF(B33<J$17,Captura!$K$16,0)+Resumen!$I$29+Resumen!$I$30","v":{"$error":"#DIV/0!"}},null,null,null,0,null,null,0,0,0,null,{"$f":"IF(B33=J$17,Captura!$K$29,0)","v":0},{"$f":"SUM(D33:F33,I33:N33)*Captura!$C$19","v":{"$error":"#DIV/0!"}},{"$error":"#DIV/0!"},null,null,6,5,0,null,{"$f":"+V32*Captura!$O$9/12","v":0},0,0,{"$f":"IF(U33=J$17,Captura!$K$33,0)","v":0},null,0,0,0,null,{"$f":"+(W33+AB33+AC33+AD33+AE33+AF33)*Captura!$C$19","v":0},0,null,{"$error":"#DIV/0!"},0]
[null,6,"2026-09-04",{"$f":"IF(B34<J$17,Captura!$K$16,0)+Resumen!$I$29+Resumen!$I$30","v":{"$error":"#DIV/0!"}},null,null,null,0,null,null,0,0,0,null,{"$f":"IF(B34=J$17,Captura!$K$29,0)","v":0},{"$f":"SUM(D34:F34,I34:N34)*Captura!$C$19","v":{"$error":"#DIV/0!"}},{"$error":"#DIV/0!"},null,null,7,6,0,null,{"$f":"+V33*Captura!$O$9/12","v":0},0,0,{"$f":"IF(U34=J$17,Captura!$K$33,0)","v":0},null,0,0,0,null,{"$f":"+(W34+AB34+AC34+AD34+AE34+AF34)*Captura!$C$19","v":0},0,null,{"$error":"#DIV/0!"},0]
[null,7,"2026-10-04",{"$f":"IF(B35<J$17,Captura!$K$16,0)+Resumen!$I$29+Resumen!$I$30","v":{"$error":"#DIV/0!"}},null,null,null,0,null,null,0,0,0,null,{"$f":"IF(B35=J$17,Captura!$K$29,0)","v":0},{"$f":"SUM(D35:F35,I35:N35)*Captura!$C$19","v":{"$error":"#DIV/0!"}},{"$error":"#DIV/0!"},null,null,8,7,0,null,{"$f":"+V34*Captura!$O$9/12","v":0},0,0,{"$f":"IF(U35=J$17,Captura!$K$33,0)","v":0},null,0,0,0,null,{"$f":"+(W35+AB35+AC35+AD35+AE35+AF35)*Captura!$C$19","v":0},0,null,{"$error":"#DIV/0!"},0]
[null,8,"2026-11-04",{"$f":"IF(B36<J$17,Captura!$K$16,0)+Resumen!$I$29+Resumen!$I$30","v":{"$error":"#DIV/0!"}},null,null,null,0,null,null,0,0,0,null,{"$f":"IF(B36=J$17,Captura!$K$29,0)","v":0},{"$f":"SUM(D36:F36,I36:N36)*Captura!$C$19","v":{"$error":"#DIV/0!"}},{"$error":"#DIV/0!"},null,null,9,8,0,null,{"$f":"+V35*Captura!$O$9/12","v":0},0,0,{"$f":"IF(U36=J$17,Captura!$K$33,0)","v":0},null,0,0,0,null,{"$f":"+(W36+AB36+AC36+AD36+AE36+AF36)*Captura!$C$19","v":0},0,null,{"$error":"#DIV/0!"},0]
[null,9,"2026-12-04",{"$f":"IF(B37<J$17,Captura!$K$16,0)+Resumen!$I$29+Resumen!$I$30","v":{"$error":"#DIV/0!"}},null,null,null,0,null,null,0,0,0,null,{"$f":"IF(B37=J$17,Captura!$K$29,0)","v":0},{"$f":"SUM(D37:F37,I37:N37)*Captura!$C$19","v":{"$error":"#DIV/0!"}},{"$error":"#DIV/0!"},null,null,10,9,0,null,{"$f":"+V36*Captura!$O$9/12","v":0},0,0,{"$f":"IF(U37=J$17,Captura!$K$33,0)","v":0},null,0,0,0,null,{"$f":"+(W37+AB37+AC37+AD37+AE37+AF37)*Captura!$C$19","v":0},0,null,{"$error":"#DIV/0!"},0]
[null,10,"2027-01-04",{"$f":"IF(B38<J$17,Captura!$K$16,0)+Resumen!$I$29+Resumen!$I$30","v":{"$error":"#DIV/0!"}},null,null,null,0,null,null,0,0,0,null,{"$f":"IF(B38=J$17,Captura!$K$29,0)","v":0},{"$f":"SUM(D38:F38,I38:N38)*Captura!$C$19","v":{"$error":"#DIV/0!"}},{"$error":"#DIV/0!"},null,null,11,10,0,null,{"$f":"+V37*Captura!$O$9/12","v":0},0,0,{"$f":"IF(U38=J$17,Captura!$K$33,0)","v":0},null,0,0,0,null,{"$f":"+(W38+AB38+AC38+AD38+AE38+AF38)*Captura!$C$19","v":0},0,null,{"$error":"#DIV/0!"},0]
[null,11,"2027-02-04",{"$f":"IF(B39<J$17,Captura!$K$16,0)+Resumen!$I$29+Resumen!$I$30","v":{"$error":"#DIV/0!"}},null,null,null,0,null,null,0,0,0,null,{"$f":"IF(B39=J$17,Captura!$K$29,0)","v":0},{"$f":"SUM(D39:F39,I39:N39)*Captura!$C$19","v":{"$error":"#DIV/0!"}},{"$error":"#DIV/0!"},null,null,12,11,0,null,{"$f":"+V38*Captura!$O$9/12","v":0},0,0,{"$f":"IF(U39=J$17,Captura!$K$33,0)","v":0},null,0,0,0,null,{"$f":"+(W39+AB39+AC39+AD39+AE39+AF39)*Captura!$C$19","v":0},0,null,{"$error":"#DIV/0!"},0]
[null,12,"2027-03-04",{"$f":"IF(B40<J$17,Captura!$K$16,0)+Resumen!$I$29+Resumen!$I$30","v":{"$error":"#DIV/0!"}},null,null,null,0,null,null,{"$f":"IF(B40+1>=$J$17,0,K28*(1+Captura!$D$35))","v":0},{"$f":"IF(B40+1>=$J$17,0,L28*(1+Captura!$D$35))","v":0},{"$f":"IF(B40+1>=$J$17,0,M28*(1+Captura!$D$35))","v":0},null,{"$f":"IF(B40=J$17,Captura!$K$29,0)","v":0},{"$f":"SUM(D40:F40,I40:N40)*Captura!$C$19","v":{"$error":"#DIV/0!"}},{"$error":"#DIV/0!"},null,null,1,12,0,null,{"$f":"+V39*Captura!$O$9/12","v":0},0,0,{"$f":"IF(U40=J$17,Captura!$K$33,0)","v":0},null,{"$f":"IF(U40+1>=$J$17,0,AC28*(1+Captura!$D$35))","v":0},{"$f":"IF(U40+1>=$J$17,0,AD28*(1+Captura!$D$35))","v":0},{"$f":"IF(U40+1>=$J$17,0,AE28*(1+Captura!$D$35))","v":395.2},null,{"$f":"+(W40+AB40+AC40+AD40+AE40+AF40)*Captura!$C$19","v":63.231999999999999},458.43200000000002,null,{"$error":"#DIV/0!"},-395.20000000000005]
[null,13,"2027-04-04",{"$f":"IF(B41<J$17,Captura!$K$16,0)+Resumen!$I$29+Resumen!$I$30","v":{"$error":"#DIV/0!"}},null,null,null,0,null,null,{"$f":"IF(B41+1>=$J$17,0,K29*(1+Captura!$D$35))","v":0},{"$f":"IF(B41+1>=$J$17,0,L29*(1+Captura!$D$35))","v":0},{"$f":"IF(B41+1>=$J$17,0,M29*(1+Captura!$D$35))","v":0},null,{"$f":"IF(B41=J$17,Captura!$K$29,0)","v":0},{"$f":"SUM(D41:F41,I41:N41)*Captura!$C$19","v":{"$error":"#DIV/0!"}},{"$error":"#DIV/0!"},null,null,2,13,0,null,{"$f":"+V40*Captura!$O$9/12","v":0},0,0,{"$f":"IF(U41=J$17,Captura!$K$33,0)","v":0},null,{"$f":"IF(U41+1>=$J$17,0,AC29*(1+Captura!$D$35))","v":0},{"$f":"IF(U41+1>=$J$17,0,AD29*(1+Captura!$D$35))","v":0},{"$f":"IF(U41+1>=$J$17,0,AE29*(1+Captura!$D$35))","v":0},null,{"$f":"+(W41+AB41+AC41+AD41+AE41+AF41)*Captura!$C$19","v":0},0,null,{"$error":"#DIV/0!"},0]
[null,14,"2027-05-04",{"$f":"IF(B42<J$17,Captura!$K$16,0)+Resumen!$I$29+Resumen!$I$30","v":{"$error":"#DIV/0!"}},null,null,null,{"$f":"IF(B42=J$17,-G$28,0)","v":0},null,null,{"$f":"IF(B42+1>=$J$17,0,K30*(1+Captura!$D$35))","v":0},{"$f":"IF(B42+1>=$J$17,0,L30*(1+Captura!$D$35))","v":0},{"$f":"IF(B42+1>=$J$17,0,M30*(1+Captura!$D$35))","v":0},null,{"$f":"IF(B42=J$17,Captura!$K$29,0)","v":0},{"$f":"SUM(D42:F42,I42:N42)*Captura!$C$19","v":{"$error":"#DIV/0!"}},{"$error":"#DIV/0!"},null,null,3,14,0,null,{"$f":"+V41*Captura!$O$9/12","v":0},0,0,{"$f":"IF(U42=J$17,Captura!$K$33,0)","v":0},null,{"$f":"IF(U42+1>=$J$17,0,AC30*(1+Captura!$D$35))","v":0},{"$f":"IF(U42+1>=$J$17,0,AD30*(1+Captura!$D$35))","v":0},{"$f":"IF(U42+1>=$J$17,0,AE30*(1+Captura!$D$35))","v":0},null,{"$f":"+(W42+AB42+AC42+AD42+AE42+AF42)*Captura!$C$19","v":0},0,null,{"$error":"#DIV/0!"},0]
[null,15,"2027-06-04",{"$f":"IF(B43<J$17,Captura!$K$16,0)+Resumen!$I$29+Resumen!$I$30","v":{"$error":"#DIV/0!"}},null,null,null,0,null,null,{"$f":"IF(B43+1>=$J$17,0,K31*(1+Captura!$D$35))","v":0},{"$f":"IF(B43+1>=$J$17,0,L31*(1+Captura!$D$35))","v":0},{"$f":"IF(B43+1>=$J$17,0,M31*(1+Captura!$D$35))","v":0},null,{"$f":"IF(B43=J$17,Captura!$K$29,0)","v":0},{"$f":"SUM(D43:F43,I43:N43)*Captura!$C$19","v":{"$error":"#DIV/0!"}},{"$error":"#DIV/0!"},null,null,4,15,0,null,{"$f":"+V42*Captura!$O$9/12","v":0},0,0,{"$f":"IF(U43=J$17,Captura!$K$33,0)","v":0},null,{"$f":"IF(U43+1>=$J$17,0,AC31*(1+Captura!$D$35))","v":0},{"$f":"IF(U43+1>=$J$17,0,AD31*(1+Captura!$D$35))","v":0},{"$f":"IF(U43+1>=$J$17,0,AE31*(1+Captura!$D$35))","v":0},null,{"$f":"+(W43+AB43+AC43+AD43+AE43+AF43)*Captura!$C$19","v":0},0,null,{"$error":"#DIV/0!"},0]
[null,16,"2027-07-04",{"$f":"IF(B44<J$17,Captura!$K$16,0)+Resumen!$I$29+Resumen!$I$30","v":{"$error":"#DIV/0!"}},null,null,null,0,null,null,{"$f":"IF(B44+1>=$J$17,0,K32*(1+Captura!$D$35))","v":0},{"$f":"IF(B44+1>=$J$17,0,L32*(1+Captura!$D$35))","v":0},{"$f":"IF(B44+1>=$J$17,0,M32*(1+Captura!$D$35))","v":0},null,{"$f":"IF(B44=J$17,Captura!$K$29,0)","v":0},{"$f":"SUM(D44:F44,I44:N44)*Captura!$C$19","v":{"$error":"#DIV/0!"}},{"$error":"#DIV/0!"},null,null,5,16,0,null,{"$f":"+V43*Captura!$O$9/12","v":0},0,0,{"$f":"IF(U44=J$17,Captura!$K$33,0)","v":0},null,{"$f":"IF(U44+1>=$J$17,0,AC32*(1+Captura!$D$35))","v":0},{"$f":"IF(U44+1>=$J$17,0,AD32*(1+Captura!$D$35))","v":0},{"$f":"IF(U44+1>=$J$17,0,AE32*(1+Captura!$D$35))","v":0},null,{"$f":"+(W44+AB44+AC44+AD44+AE44+AF44)*Captura!$C$19","v":0},0,null,{"$error":"#DIV/0!"},0]
[null,17,"2027-08-04",{"$f":"IF(B45<J$17,Captura!$K$16,0)+Resumen!$I$29+Resumen!$I$30","v":{"$error":"#DIV/0!"}},null,null,null,0,null,null,{"$f":"IF(B45+1>=$J$17,0,K33*(1+Captura!$D$35))","v":0},{"$f":"IF(B45+1>=$J$17,0,L33*(1+Captura!$D$35))","v":0},{"$f":"IF(B45+1>=$J$17,0,M33*(1+Captura!$D$35))","v":0},null,{"$f":"IF(B45=J$17,Captura!$K$29,0)","v":0},{"$f":"SUM(D45:F45,I45:N45)*Captura!$C$19","v":{"$error":"#DIV/0!"}},{"$error":"#DIV/0!"},null,null,6,17,0,null,{"$f":"+V44*Captura!$O$9/12","v":0},0,0,{"$f":"IF(U45=J$17,Captura!$K$33,0)","v":0},null,{"$f":"IF(U45+1>=$J$17,0,AC33*(1+Captura!$D$35))","v":0},{"$f":"IF(U45+1>=$J$17,0,AD33*(1+Captura!$D$35))","v":0},{"$f":"IF(U45+1>=$J$17,0,AE33*(1+Captura!$D$35))","v":0},null,{"$f":"+(W45+AB45+AC45+AD45+AE45+AF45)*Captura!$C$19","v":0},0,null,{"$error":"#DIV/0!"},0]
[null,18,"2027-09-04",{"$f":"IF(B46<J$17,Captura!$K$16,0)","v":0},null,null,null,0,null,null,{"$f":"IF(B46+1>=$J$17,0,K34*(1+Captura!$D$35))","v":0},{"$f":"IF(B46+1>=$J$17,0,L34*(1+Captura!$D$35))","v":0},{"$f":"IF(B46+1>=$J$17,0,M34*(1+Captura!$D$35))","v":0},null,{"$f":"IF(B46=J$17,Captura!$K$29,0)","v":0},{"$f":"SUM(D46:F46,I46:N46)*Captura!$C$19","v":0},0,null,null,7,18,0,null,{"$f":"+V45*Captura!$O$9/12","v":0},0,0,{"$f":"IF(U46=J$17,Captura!$K$33,0)","v":0},null,{"$f":"IF(U46+1>=$J$17,0,AC34*(1+Captura!$D$35))","v":0},{"$f":"IF(U46+1>=$J$17,0,AD34*(1+Captura!$D$35))","v":0},{"$f":"IF(U46+1>=$J$17,0,AE34*(1+Captura!$D$35))","v":0},null,{"$f":"+(W46+AB46+AC46+AD46+AE46+AF46)*Captura!$C$19","v":0},0,null,0,0]
[null,19,"2027-10-04",{"$f":"IF(B47<J$17,Captura!$K$16,0)","v":0},null,null,null,0,null,null,{"$f":"IF(B47+1>=$J$17,0,K35*(1+Captura!$D$35))","v":0},{"$f":"IF(B47+1>=$J$17,0,L35*(1+Captura!$D$35))","v":0},{"$f":"IF(B47+1>=$J$17,0,M35*(1+Captura!$D$35))","v":0},null,{"$f":"IF(B47=J$17,Captura!$K$29,0)","v":0},{"$f":"SUM(D47:F47,I47:N47)*Captura!$C$19","v":0},0,null,null,8,19,0,null,{"$f":"+V46*Captura!$O$9/12","v":0},0,0,{"$f":"IF(U47=J$17,Captura!$K$33,0)","v":0},null,{"$f":"IF(U47+1>=$J$17,0,AC35*(1+Captura!$D$35))","v":0},{"$f":"IF(U47+1>=$J$17,0,AD35*(1+Captura!$D$35))","v":0},{"$f":"IF(U47+1>=$J$17,0,AE35*(1+Captura!$D$35))","v":0},null,{"$f":"+(W47+AB47+AC47+AD47+AE47+AF47)*Captura!$C$19","v":0},0,null,0,0]
[null,20,"2027-11-04",{"$f":"IF(B48<J$17,Captura!$K$16,0)","v":0},null,null,null,0,null,null,{"$f":"IF(B48+1>=$J$17,0,K36*(1+Captura!$D$35))","v":0},{"$f":"IF(B48+1>=$J$17,0,L36*(1+Captura!$D$35))","v":0},{"$f":"IF(B48+1>=$J$17,0,M36*(1+Captura!$D$35))","v":0},null,{"$f":"IF(B48=J$17,Captura!$K$29,0)","v":0},{"$f":"SUM(D48:F48,I48:N48)*Captura!$C$19","v":0},0,null,null,9,20,0,null,{"$f":"+V47*Captura!$O$9/12","v":0},0,0,{"$f":"IF(U48=J$17,Captura!$K$33,0)","v":0},null,{"$f":"IF(U48+1>=$J$17,0,AC36*(1+Captura!$D$35))","v":0},{"$f":"IF(U48+1>=$J$17,0,AD36*(1+Captura!$D$35))","v":0},{"$f":"IF(U48+1>=$J$17,0,AE36*(1+Captura!$D$35))","v":0},null,{"$f":"+(W48+AB48+AC48+AD48+AE48+AF48)*Captura!$C$19","v":0},0,null,0,0]
[null,21,"2027-12-04",{"$f":"IF(B49<J$17,Captura!$K$16,0)","v":0},null,null,null,0,null,null,{"$f":"IF(B49+1>=$J$17,0,K37*(1+Captura!$D$35))","v":0},{"$f":"IF(B49+1>=$J$17,0,L37*(1+Captura!$D$35))","v":0},{"$f":"IF(B49+1>=$J$17,0,M37*(1+Captura!$D$35))","v":0},null,{"$f":"IF(B49=J$17,Captura!$K$29,0)","v":0},{"$f":"SUM(D49:F49,I49:N49)*Captura!$C$19","v":0},0,null,null,10,21,0,null,{"$f":"+V48*Captura!$O$9/12","v":0},0,0,{"$f":"IF(U49=J$17,Captura!$K$33,0)","v":0},null,{"$f":"IF(U49+1>=$J$17,0,AC37*(1+Captura!$D$35))","v":0},{"$f":"IF(U49+1>=$J$17,0,AD37*(1+Captura!$D$35))","v":0},{"$f":"IF(U49+1>=$J$17,0,AE37*(1+Captura!$D$35))","v":0},null,{"$f":"+(W49+AB49+AC49+AD49+AE49+AF49)*Captura!$C$19","v":0},0,null,0,0]
[null,22,"2028-01-04",{"$f":"IF(B50<J$17,Captura!$K$16,0)","v":0},null,null,null,0,null,null,{"$f":"IF(B50+1>=$J$17,0,K38*(1+Captura!$D$35))","v":0},{"$f":"IF(B50+1>=$J$17,0,L38*(1+Captura!$D$35))","v":0},{"$f":"IF(B50+1>=$J$17,0,M38*(1+Captura!$D$35))","v":0},null,{"$f":"IF(B50=J$17,Captura!$K$29,0)","v":0},{"$f":"SUM(D50:F50,I50:N50)*Captura!$C$19","v":0},0,null,null,11,22,0,null,{"$f":"+V49*Captura!$O$9/12","v":0},0,0,{"$f":"IF(U50=J$17,Captura!$K$33,0)","v":0},null,{"$f":"IF(U50+1>=$J$17,0,AC38*(1+Captura!$D$35))","v":0},{"$f":"IF(U50+1>=$J$17,0,AD38*(1+Captura!$D$35))","v":0},{"$f":"IF(U50+1>=$J$17,0,AE38*(1+Captura!$D$35))","v":0},null,{"$f":"+(W50+AB50+AC50+AD50+AE50+AF50)*Captura!$C$19","v":0},0,null,0,0]
[null,23,"2028-02-04",{"$f":"IF(B51<J$17,Captura!$K$16,0)","v":0},null,null,null,0,null,null,{"$f":"IF(B51+1>=$J$17,0,K39*(1+Captura!$D$35))","v":0},{"$f":"IF(B51+1>=$J$17,0,L39*(1+Captura!$D$35))","v":0},{"$f":"IF(B51+1>=$J$17,0,M39*(1+Captura!$D$35))","v":0},null,{"$f":"IF(B51=J$17,Captura!$K$29,0)","v":0},{"$f":"SUM(D51:F51,I51:N51)*Captura!$C$19","v":0},0,null,null,12,23,0,null,{"$f":"+V50*Captura!$O$9/12","v":0},0,0,{"$f":"IF(U51=J$17,Captura!$K$33,0)","v":0},null,{"$f":"IF(U51+1>=$J$17,0,AC39*(1+Captura!$D$35))","v":0},{"$f":"IF(U51+1>=$J$17,0,AD39*(1+Captura!$D$35))","v":0},{"$f":"IF(U51+1>=$J$17,0,AE39*(1+Captura!$D$35))","v":0},null,{"$f":"+(W51+AB51+AC51+AD51+AE51+AF51)*Captura!$C$19","v":0},0,null,0,0]
[null,24,"2028-03-04",{"$f":"IF(B52<J$17,Captura!$K$16,0)","v":0},null,null,null,0,null,null,{"$f":"IF(B52+1>=$J$17,0,K40*(1+Captura!$D$35))","v":0},{"$f":"IF(B52+1>=$J$17,0,L40*(1+Captura!$D$35))","v":0},{"$f":"IF(B52+1>=$J$17,0,M40*(1+Captura!$D$35))","v":0},null,{"$f":"IF(B52=J$17,Captura!$K$29,0)","v":0},{"$f":"SUM(D52:F52,I52:N52)*Captura!$C$19","v":0},0,null,null,1,24,0,null,{"$f":"+V51*Captura!$O$9/12","v":0},0,0,{"$f":"IF(U52=J$17,Captura!$K$33,0)","v":0},null,{"$f":"IF(U52+1>=$J$17,0,AC40*(1+Captura!$D$35))","v":0},{"$f":"IF(U52+1>=$J$17,0,AD40*(1+Captura!$D$35))","v":0},{"$f":"IF(U52+1>=$J$17,0,AE40*(1+Captura!$D$35))","v":0},null,{"$f":"+(W52+AB52+AC52+AD52+AE52+AF52)*Captura!$C$19","v":0},0,null,0,0]
[null,25,"2028-04-04",{"$f":"IF(B53<J$17,Captura!$K$16,0)","v":0},null,null,null,0,null,null,{"$f":"IF(B53+1>=$J$17,0,K41*(1+Captura!$D$35))","v":0},{"$f":"IF(B53+1>=$J$17,0,L41*(1+Captura!$D$35))","v":0},{"$f":"IF(B53+1>=$J$17,0,M41*(1+Captura!$D$35))","v":0},null,{"$f":"IF(B53=J$17,Captura!$K$29,0)","v":0},{"$f":"SUM(D53:F53,I53:N53)*Captura!$C$19","v":0},0,null,null,2,25,0,null,{"$f":"+V52*Captura!$O$9/12","v":0},0,0,{"$f":"IF(U53=J$17,Captura!$K$33,0)","v":0},null,{"$f":"IF(U53+1>=$J$17,0,AC41*(1+Captura!$D$35))","v":0},{"$f":"IF(U53+1>=$J$17,0,AD41*(1+Captura!$D$35))","v":0},{"$f":"IF(U53+1>=$J$17,0,AE41*(1+Captura!$D$35))","v":0},null,{"$f":"+(W53+AB53+AC53+AD53+AE53+AF53)*Captura!$C$19","v":0},0,null,0,0]
[null,26,"2028-05-04",{"$f":"IF(B54<J$17,Captura!$K$16,0)","v":0},null,null,null,0,null,null,{"$f":"IF(B54+1>=$J$17,0,K42*(1+Captura!$D$35))","v":0},{"$f":"IF(B54+1>=$J$17,0,L42*(1+Captura!$D$35))","v":0},{"$f":"IF(B54+1>=$J$17,0,M42*(1+Captura!$D$35))","v":0},null,{"$f":"IF(B54=J$17,Captura!$K$29,0)","v":0},{"$f":"SUM(D54:F54,I54:N54)*Captura!$C$19","v":0},0,null,null,3,26,0,null,{"$f":"+V53*Captura!$O$9/12","v":0},0,0,{"$f":"IF(U54=J$17,Captura!$K$33,0)","v":0},null,{"$f":"IF(U54+1>=$J$17,0,AC42*(1+Captura!$D$35))","v":0},{"$f":"IF(U54+1>=$J$17,0,AD42*(1+Captura!$D$35))","v":0},{"$f":"IF(U54+1>=$J$17,0,AE42*(1+Captura!$D$35))","v":0},null,{"$f":"+(W54+AB54+AC54+AD54+AE54+AF54)*Captura!$C$19","v":0},0,null,0,0]
[null,27,"2028-06-04",{"$f":"IF(B55<J$17,Captura!$K$16,0)","v":0},null,null,null,0,null,null,{"$f":"IF(B55+1>=$J$17,0,K43*(1+Captura!$D$35))","v":0},{"$f":"IF(B55+1>=$J$17,0,L43*(1+Captura!$D$35))","v":0},{"$f":"IF(B55+1>=$J$17,0,M43*(1+Captura!$D$35))","v":0},null,{"$f":"IF(B55=J$17,Captura!$K$29,0)","v":0},{"$f":"SUM(D55:F55,I55:N55)*Captura!$C$19","v":0},0,null,null,4,27,0,null,{"$f":"+V54*Captura!$O$9/12","v":0},0,0,{"$f":"IF(U55=J$17,Captura!$K$33,0)","v":0},null,{"$f":"IF(U55+1>=$J$17,0,AC43*(1+Captura!$D$35))","v":0},{"$f":"IF(U55+1>=$J$17,0,AD43*(1+Captura!$D$35))","v":0},{"$f":"IF(U55+1>=$J$17,0,AE43*(1+Captura!$D$35))","v":0},null,{"$f":"+(W55+AB55+AC55+AD55+AE55+AF55)*Captura!$C$19","v":0},0,null,0,0]
[null,28,"2028-07-04",{"$f":"IF(B56<J$17,Captura!$K$16,0)","v":0},null,null,null,0,null,null,{"$f":"IF(B56+1>=$J$17,0,K44*(1+Captura!$D$35))","v":0},{"$f":"IF(B56+1>=$J$17,0,L44*(1+Captura!$D$35))","v":0},{"$f":"IF(B56+1>=$J$17,0,M44*(1+Captura!$D$35))","v":0},null,{"$f":"IF(B56=J$17,Captura!$K$29,0)","v":0},{"$f":"SUM(D56:F56,I56:N56)*Captura!$C$19","v":0},0,null,null,5,28,0,null,{"$f":"+V55*Captura!$O$9/12","v":0},0,0,{"$f":"IF(U56=J$17,Captura!$K$33,0)","v":0},null,{"$f":"IF(U56+1>=$J$17,0,AC44*(1+Captura!$D$35))","v":0},{"$f":"IF(U56+1>=$J$17,0,AD44*(1+Captura!$D$35))","v":0},{"$f":"IF(U56+1>=$J$17,0,AE44*(1+Captura!$D$35))","v":0},null,{"$f":"+(W56+AB56+AC56+AD56+AE56+AF56)*Captura!$C$19","v":0},0,null,0,0]
[null,29,"2028-08-04",{"$f":"IF(B57<J$17,Captura!$K$16,0)","v":0},null,null,null,0,null,null,{"$f":"IF(B57+1>=$J$17,0,K45*(1+Captura!$D$35))","v":0},{"$f":"IF(B57+1>=$J$17,0,L45*(1+Captura!$D$35))","v":0},{"$f":"IF(B57+1>=$J$17,0,M45*(1+Captura!$D$35))","v":0},null,{"$f":"IF(B57=J$17,Captura!$K$29,0)","v":0},{"$f":"SUM(D57:F57,I57:N57)*Captura!$C$19","v":0},0,null,null,6,29,0,null,{"$f":"+V56*Captura!$O$9/12","v":0},0,0,{"$f":"IF(U57=J$17,Captura!$K$33,0)","v":0},null,{"$f":"IF(U57+1>=$J$17,0,AC45*(1+Captura!$D$35))","v":0},{"$f":"IF(U57+1>=$J$17,0,AD45*(1+Captura!$D$35))","v":0},{"$f":"IF(U57+1>=$J$17,0,AE45*(1+Captura!$D$35))","v":0},null,{"$f":"+(W57+AB57+AC57+AD57+AE57+AF57)*Captura!$C$19","v":0},0,null,0,0]
[null,30,"2028-09-04",{"$f":"IF(B58<J$17,Captura!$K$16,0)","v":0},null,null,null,0,null,null,{"$f":"IF(B58+1>=$J$17,0,K46*(1+Captura!$D$35))","v":0},{"$f":"IF(B58+1>=$J$17,0,L46*(1+Captura!$D$35))","v":0},{"$f":"IF(B58+1>=$J$17,0,M46*(1+Captura!$D$35))","v":0},null,{"$f":"IF(B58=J$17,Captura!$K$29,0)","v":0},{"$f":"SUM(D58:F58,I58:N58)*Captura!$C$19","v":0},0,null,null,7,30,0,null,{"$f":"+V57*Captura!$O$9/12","v":0},0,0,{"$f":"IF(U58=J$17,Captura!$K$33,0)","v":0},null,{"$f":"IF(U58+1>=$J$17,0,AC46*(1+Captura!$D$35))","v":0},{"$f":"IF(U58+1>=$J$17,0,AD46*(1+Captura!$D$35))","v":0},{"$f":"IF(U58+1>=$J$17,0,AE46*(1+Captura!$D$35))","v":0},null,{"$f":"+(W58+AB58+AC58+AD58+AE58+AF58)*Captura!$C$19","v":0},0,null,0,0]
[null,31,"2028-10-04",{"$f":"IF(B59<J$17,Captura!$K$16,0)","v":0},null,null,null,0,null,null,{"$f":"IF(B59+1>=$J$17,0,K47*(1+Captura!$D$35))","v":0},{"$f":"IF(B59+1>=$J$17,0,L47*(1+Captura!$D$35))","v":0},{"$f":"IF(B59+1>=$J$17,0,M47*(1+Captura!$D$35))","v":0},null,{"$f":"IF(B59=J$17,Captura!$K$29,0)","v":0},{"$f":"SUM(D59:F59,I59:N59)*Captura!$C$19","v":0},0,null,null,8,31,0,null,{"$f":"+V58*Captura!$O$9/12","v":0},0,0,{"$f":"IF(U59=J$17,Captura!$K$33,0)","v":0},null,{"$f":"IF(U59+1>=$J$17,0,AC47*(1+Captura!$D$35))","v":0},{"$f":"IF(U59+1>=$J$17,0,AD47*(1+Captura!$D$35))","v":0},{"$f":"IF(U59+1>=$J$17,0,AE47*(1+Captura!$D$35))","v":0},null,{"$f":"+(W59+AB59+AC59+AD59+AE59+AF59)*Captura!$C$19","v":0},0,null,0,0]
[null,32,"2028-11-04",{"$f":"IF(B60<J$17,Captura!$K$16,0)","v":0},null,null,null,0,null,null,{"$f":"IF(B60+1>=$J$17,0,K48*(1+Captura!$D$35))","v":0},{"$f":"IF(B60+1>=$J$17,0,L48*(1+Captura!$D$35))","v":0},{"$f":"IF(B60+1>=$J$17,0,M48*(1+Captura!$D$35))","v":0},null,{"$f":"IF(B60=J$17,Captura!$K$29,0)","v":0},{"$f":"SUM(D60:F60,I60:N60)*Captura!$C$19","v":0},0,null,null,9,32,0,null,{"$f":"+V59*Captura!$O$9/12","v":0},0,0,{"$f":"IF(U60=J$17,Captura!$K$33,0)","v":0},null,{"$f":"IF(U60+1>=$J$17,0,AC48*(1+Captura!$D$35))","v":0},{"$f":"IF(U60+1>=$J$17,0,AD48*(1+Captura!$D$35))","v":0},{"$f":"IF(U60+1>=$J$17,0,AE48*(1+Captura!$D$35))","v":0},null,{"$f":"+(W60+AB60+AC60+AD60+AE60+AF60)*Captura!$C$19","v":0},0,null,0,0]
[null,33,"2028-12-04",{"$f":"IF(B61<J$17,Captura!$K$16,0)","v":0},null,null,null,0,null,null,{"$f":"IF(B61+1>=$J$17,0,K49*(1+Captura!$D$35))","v":0},{"$f":"IF(B61+1>=$J$17,0,L49*(1+Captura!$D$35))","v":0},{"$f":"IF(B61+1>=$J$17,0,M49*(1+Captura!$D$35))","v":0},null,{"$f":"IF(B61=J$17,Captura!$K$29,0)","v":0},{"$f":"SUM(D61:F61,I61:N61)*Captura!$C$19","v":0},0,null,null,10,33,0,null,{"$f":"+V60*Captura!$O$9/12","v":0},0,0,{"$f":"IF(U61=J$17,Captura!$K$33,0)","v":0},null,{"$f":"IF(U61+1>=$J$17,0,AC49*(1+Captura!$D$35))","v":0},{"$f":"IF(U61+1>=$J$17,0,AD49*(1+Captura!$D$35))","v":0},{"$f":"IF(U61+1>=$J$17,0,AE49*(1+Captura!$D$35))","v":0},null,{"$f":"+(W61+AB61+AC61+AD61+AE61+AF61)*Captura!$C$19","v":0},0,null,0,0]
[null,34,"2029-01-04",{"$f":"IF(B62<J$17,Captura!$K$16,0)","v":0},null,null,null,0,null,null,{"$f":"IF(B62+1>=$J$17,0,K50*(1+Captura!$D$35))","v":0},{"$f":"IF(B62+1>=$J$17,0,L50*(1+Captura!$D$35))","v":0},{"$f":"IF(B62+1>=$J$17,0,M50*(1+Captura!$D$35))","v":0},null,{"$f":"IF(B62=J$17,Captura!$K$29,0)","v":0},{"$f":"SUM(D62:F62,I62:N62)*Captura!$C$19","v":0},0,null,null,11,34,0,null,{"$f":"+V61*Captura!$O$9/12","v":0},0,0,{"$f":"IF(U62=J$17,Captura!$K$33,0)","v":0},null,{"$f":"IF(U62+1>=$J$17,0,AC50*(1+Captura!$D$35))","v":0},{"$f":"IF(U62+1>=$J$17,0,AD50*(1+Captura!$D$35))","v":0},{"$f":"IF(U62+1>=$J$17,0,AE50*(1+Captura!$D$35))","v":0},null,{"$f":"+(W62+AB62+AC62+AD62+AE62+AF62)*Captura!$C$19","v":0},0,null,0,0]
[null,35,"2029-02-04",{"$f":"IF(B63<J$17,Captura!$K$16,0)","v":0},null,null,null,0,null,null,{"$f":"IF(B63+1>=$J$17,0,K51*(1+Captura!$D$35))","v":0},{"$f":"IF(B63+1>=$J$17,0,L51*(1+Captura!$D$35))","v":0},{"$f":"IF(B63+1>=$J$17,0,M51*(1+Captura!$D$35))","v":0},null,{"$f":"IF(B63=J$17,Captura!$K$29,0)","v":0},{"$f":"SUM(D63:F63,I63:N63)*Captura!$C$19","v":0},0,null,null,12,35,0,null,{"$f":"+V62*Captura!$O$9/12","v":0},0,0,{"$f":"IF(U63=J$17,Captura!$K$33,0)","v":0},null,{"$f":"IF(U63+1>=$J$17,0,AC51*(1+Captura!$D$35))","v":0},{"$f":"IF(U63+1>=$J$17,0,AD51*(1+Captura!$D$35))","v":0},{"$f":"IF(U63+1>=$J$17,0,AE51*(1+Captura!$D$35))","v":0},null,{"$f":"+(W63+AB63+AC63+AD63+AE63+AF63)*Captura!$C$19","v":0},0,null,0,0]
[null,36,"2029-03-04",{"$f":"IF(B64<J$17,Captura!$K$16,0)","v":0},null,null,null,0,null,null,{"$f":"IF(B64+1>=$J$17,0,K52*(1+Captura!$D$35))","v":0},{"$f":"IF(B64+1>=$J$17,0,L52*(1+Captura!$D$35))","v":0},{"$f":"IF(B64+1>=$J$17,0,M52*(1+Captura!$D$35))","v":0},null,{"$f":"IF(B64=J$17,Captura!$K$29,0)","v":0},{"$f":"SUM(D64:F64,I64:N64)*Captura!$C$19","v":0},0,null,null,1,36,0,null,{"$f":"+V63*Captura!$O$9/12","v":0},0,0,{"$f":"IF(U64=J$17,Captura!$K$33,0)","v":0},null,{"$f":"IF(U64+1>=$J$17,0,AC52*(1+Captura!$D$35))","v":0},{"$f":"IF(U64+1>=$J$17,0,AD52*(1+Captura!$D$35))","v":0},{"$f":"IF(U64+1>=$J$17,0,AE52*(1+Captura!$D$35))","v":0},null,{"$f":"+(W64+AB64+AC64+AD64+AE64+AF64)*Captura!$C$19","v":0},0,null,0,0]
[null,37,"2029-04-04",{"$f":"IF(B65<J$17,Captura!$K$16,0)","v":0},null,null,null,0,null,null,{"$f":"IF(B65+1>=$J$17,0,K53*(1+Captura!$D$35))","v":0},{"$f":"IF(B65+1>=$J$17,0,L53*(1+Captura!$D$35))","v":0},{"$f":"IF(B65+1>=$J$17,0,M53*(1+Captura!$D$35))","v":0},null,{"$f":"IF(B65=J$17,Captura!$K$29,0)","v":0},{"$f":"SUM(D65:F65,I65:N65)*Captura!$C$19","v":0},0,null,null,2,37,0,null,{"$f":"+V64*Captura!$O$9/12","v":0},0,0,{"$f":"IF(U65=J$17,Captura!$K$33,0)","v":0},null,{"$f":"IF(U65+1>=$J$17,0,AC53*(1+Captura!$D$35))","v":0},{"$f":"IF(U65+1>=$J$17,0,AD53*(1+Captura!$D$35))","v":0},{"$f":"IF(U65+1>=$J$17,0,AE53*(1+Captura!$D$35))","v":0},null,{"$f":"+(W65+AB65+AC65+AD65+AE65+AF65)*Captura!$C$19","v":0},0,null,0,0]
[null,38,"2029-05-04",{"$f":"IF(B66<J$17,Captura!$K$16,0)","v":0},null,null,null,0,null,null,{"$f":"IF(B66+1>=$J$17,0,K54*(1+Captura!$D$35))","v":0},{"$f":"IF(B66+1>=$J$17,0,L54*(1+Captura!$D$35))","v":0},{"$f":"IF(B66+1>=$J$17,0,M54*(1+Captura!$D$35))","v":0},null,{"$f":"IF(B66=J$17,Captura!$K$29,0)","v":0},{"$f":"SUM(D66:F66,I66:N66)*Captura!$C$19","v":0},0,null,null,3,38,0,null,{"$f":"+V65*Captura!$O$9/12","v":0},0,0,{"$f":"IF(U66=J$17,Captura!$K$33,0)","v":0},null,{"$f":"IF(U66+1>=$J$17,0,AC54*(1+Captura!$D$35))","v":0},{"$f":"IF(U66+1>=$J$17,0,AD54*(1+Captura!$D$35))","v":0},{"$f":"IF(U66+1>=$J$17,0,AE54*(1+Captura!$D$35))","v":0},null,{"$f":"+(W66+AB66+AC66+AD66+AE66+AF66)*Captura!$C$19","v":0},0,null,0,0]
[null,39,"2029-06-04",{"$f":"IF(B67<J$17,Captura!$K$16,0)","v":0},null,null,null,0,null,null,{"$f":"IF(B67+1>=$J$17,0,K55*(1+Captura!$D$35))","v":0},{"$f":"IF(B67+1>=$J$17,0,L55*(1+Captura!$D$35))","v":0},{"$f":"IF(B67+1>=$J$17,0,M55*(1+Captura!$D$35))","v":0},null,{"$f":"IF(B67=J$17,Captura!$K$29,0)","v":0},{"$f":"SUM(D67:F67,I67:N67)*Captura!$C$19","v":0},0,null,null,4,39,0,null,{"$f":"+V66*Captura!$O$9/12","v":0},0,0,{"$f":"IF(U67=J$17,Captura!$K$33,0)","v":0},null,{"$f":"IF(U67+1>=$J$17,0,AC55*(1+Captura!$D$35))","v":0},{"$f":"IF(U67+1>=$J$17,0,AD55*(1+Captura!$D$35))","v":0},{"$f":"IF(U67+1>=$J$17,0,AE55*(1+Captura!$D$35))","v":0},null,{"$f":"+(W67+AB67+AC67+AD67+AE67+AF67)*Captura!$C$19","v":0},0,null,0,0]
[null,40,"2029-07-04",{"$f":"IF(B68<J$17,Captura!$K$16,0)","v":0},null,null,null,0,null,null,{"$f":"IF(B68+1>=$J$17,0,K56*(1+Captura!$D$35))","v":0},{"$f":"IF(B68+1>=$J$17,0,L56*(1+Captura!$D$35))","v":0},{"$f":"IF(B68+1>=$J$17,0,M56*(1+Captura!$D$35))","v":0},null,{"$f":"IF(B68=J$17,Captura!$K$29,0)","v":0},{"$f":"SUM(D68:F68,I68:N68)*Captura!$C$19","v":0},0,null,null,5,40,0,null,{"$f":"+V67*Captura!$O$9/12","v":0},0,0,{"$f":"IF(U68=J$17,Captura!$K$33,0)","v":0},null,{"$f":"IF(U68+1>=$J$17,0,AC56*(1+Captura!$D$35))","v":0},{"$f":"IF(U68+1>=$J$17,0,AD56*(1+Captura!$D$35))","v":0},{"$f":"IF(U68+1>=$J$17,0,AE56*(1+Captura!$D$35))","v":0},null,{"$f":"+(W68+AB68+AC68+AD68+AE68+AF68)*Captura!$C$19","v":0},0,null,0,0]
[null,41,"2029-08-04",{"$f":"IF(B69<J$17,Captura!$K$16,0)","v":0},null,null,null,0,null,null,{"$f":"IF(B69+1>=$J$17,0,K57*(1+Captura!$D$35))","v":0},{"$f":"IF(B69+1>=$J$17,0,L57*(1+Captura!$D$35))","v":0},{"$f":"IF(B69+1>=$J$17,0,M57*(1+Captura!$D$35))","v":0},null,{"$f":"IF(B69=J$17,Captura!$K$29,0)","v":0},{"$f":"SUM(D69:F69,I69:N69)*Captura!$C$19","v":0},0,null,null,6,41,0,null,{"$f":"+V68*Captura!$O$9/12","v":0},0,0,{"$f":"IF(U69=J$17,Captura!$K$33,0)","v":0},null,{"$f":"IF(U69+1>=$J$17,0,AC57*(1+Captura!$D$35))","v":0},{"$f":"IF(U69+1>=$J$17,0,AD57*(1+Captura!$D$35))","v":0},{"$f":"IF(U69+1>=$J$17,0,AE57*(1+Captura!$D$35))","v":0},null,{"$f":"+(W69+AB69+AC69+AD69+AE69+AF69)*Captura!$C$19","v":0},0,null,0,0]
[null,42,"2029-09-04",{"$f":"IF(B70<J$17,Captura!$K$16,0)","v":0},null,null,null,0,null,null,{"$f":"IF(B70+1>=$J$17,0,K58*(1+Captura!$D$35))","v":0},{"$f":"IF(B70+1>=$J$17,0,L58*(1+Captura!$D$35))","v":0},{"$f":"IF(B70+1>=$J$17,0,M58*(1+Captura!$D$35))","v":0},null,{"$f":"IF(B70=J$17,Captura!$K$29,0)","v":0},{"$f":"SUM(D70:F70,I70:N70)*Captura!$C$19","v":0},0,null,null,7,42,0,null,{"$f":"+V69*Captura!$O$9/12","v":0},0,0,{"$f":"IF(U70=J$17,Captura!$K$33,0)","v":0},null,{"$f":"IF(U70+1>=$J$17,0,AC58*(1+Captura!$D$35))","v":0},{"$f":"IF(U70+1>=$J$17,0,AD58*(1+Captura!$D$35))","v":0},{"$f":"IF(U70+1>=$J$17,0,AE58*(1+Captura!$D$35))","v":0},null,{"$f":"+(W70+AB70+AC70+AD70+AE70+AF70)*Captura!$C$19","v":0},0,null,0,0]
[null,43,"2029-10-04",{"$f":"IF(B71<J$17,Captura!$K$16,0)","v":0},null,null,null,0,null,null,{"$f":"IF(B71+1>=$J$17,0,K59*(1+Captura!$D$35))","v":0},{"$f":"IF(B71+1>=$J$17,0,L59*(1+Captura!$D$35))","v":0},{"$f":"IF(B71+1>=$J$17,0,M59*(1+Captura!$D$35))","v":0},null,{"$f":"IF(B71=J$17,Captura!$K$29,0)","v":0},{"$f":"SUM(D71:F71,I71:N71)*Captura!$C$19","v":0},0,null,null,8,43,0,null,{"$f":"+V70*Captura!$O$9/12","v":0},0,0,{"$f":"IF(U71=J$17,Captura!$K$33,0)","v":0},null,{"$f":"IF(U71+1>=$J$17,0,AC59*(1+Captura!$D$35))","v":0},{"$f":"IF(U71+1>=$J$17,0,AD59*(1+Captura!$D$35))","v":0},{"$f":"IF(U71+1>=$J$17,0,AE59*(1+Captura!$D$35))","v":0},null,{"$f":"+(W71+AB71+AC71+AD71+AE71+AF71)*Captura!$C$19","v":0},0,null,0,0]
[null,44,"2029-11-04",{"$f":"IF(B72<J$17,Captura!$K$16,0)","v":0},null,null,null,0,null,null,{"$f":"IF(B72+1>=$J$17,0,K60*(1+Captura!$D$35))","v":0},{"$f":"IF(B72+1>=$J$17,0,L60*(1+Captura!$D$35))","v":0},{"$f":"IF(B72+1>=$J$17,0,M60*(1+Captura!$D$35))","v":0},null,{"$f":"IF(B72=J$17,Captura!$K$29,0)","v":0},{"$f":"SUM(D72:F72,I72:N72)*Captura!$C$19","v":0},0,null,null,9,44,0,null,{"$f":"+V71*Captura!$O$9/12","v":0},0,0,{"$f":"IF(U72=J$17,Captura!$K$33,0)","v":0},null,{"$f":"IF(U72+1>=$J$17,0,AC60*(1+Captura!$D$35))","v":0},{"$f":"IF(U72+1>=$J$17,0,AD60*(1+Captura!$D$35))","v":0},{"$f":"IF(U72+1>=$J$17,0,AE60*(1+Captura!$D$35))","v":0},null,{"$f":"+(W72+AB72+AC72+AD72+AE72+AF72)*Captura!$C$19","v":0},0,null,0,0]
[null,45,"2029-12-04",{"$f":"IF(B73<J$17,Captura!$K$16,0)","v":0},null,null,null,0,null,null,{"$f":"IF(B73+1>=$J$17,0,K61*(1+Captura!$D$35))","v":0},{"$f":"IF(B73+1>=$J$17,0,L61*(1+Captura!$D$35))","v":0},{"$f":"IF(B73+1>=$J$17,0,M61*(1+Captura!$D$35))","v":0},null,{"$f":"IF(B73=J$17,Captura!$K$29,0)","v":0},{"$f":"SUM(D73:F73,I73:N73)*Captura!$C$19","v":0},0,null,null,10,45,0,null,{"$f":"+V72*Captura!$O$9/12","v":0},0,0,{"$f":"IF(U73=J$17,Captura!$K$33,0)","v":0},null,{"$f":"IF(U73+1>=$J$17,0,AC61*(1+Captura!$D$35))","v":0},{"$f":"IF(U73+1>=$J$17,0,AD61*(1+Captura!$D$35))","v":0},{"$f":"IF(U73+1>=$J$17,0,AE61*(1+Captura!$D$35))","v":0},null,{"$f":"+(W73+AB73+AC73+AD73+AE73+AF73)*Captura!$C$19","v":0},0,null,0,0]
[null,46,"2030-01-04",{"$f":"IF(B74<J$17,Captura!$K$16,0)","v":0},null,null,null,0,null,null,{"$f":"IF(B74+1>=$J$17,0,K62*(1+Captura!$D$35))","v":0},{"$f":"IF(B74+1>=$J$17,0,L62*(1+Captura!$D$35))","v":0},{"$f":"IF(B74+1>=$J$17,0,M62*(1+Captura!$D$35))","v":0},null,{"$f":"IF(B74=J$17,Captura!$K$29,0)","v":0},{"$f":"SUM(D74:F74,I74:N74)*Captura!$C$19","v":0},0,null,null,11,46,0,null,{"$f":"+V73*Captura!$O$9/12","v":0},0,0,{"$f":"IF(U74=J$17,Captura!$K$33,0)","v":0},null,{"$f":"IF(U74+1>=$J$17,0,AC62*(1+Captura!$D$35))","v":0},{"$f":"IF(U74+1>=$J$17,0,AD62*(1+Captura!$D$35))","v":0},{"$f":"IF(U74+1>=$J$17,0,AE62*(1+Captura!$D$35))","v":0},null,{"$f":"+(W74+AB74+AC74+AD74+AE74+AF74)*Captura!$C$19","v":0},0,null,0,0]
[null,47,"2030-02-04",{"$f":"IF(B75<J$17,Captura!$K$16,0)","v":0},null,null,null,0,null,null,{"$f":"IF(B75+1>=$J$17,0,K63*(1+Captura!$D$35))","v":0},{"$f":"IF(B75+1>=$J$17,0,L63*(1+Captura!$D$35))","v":0},{"$f":"IF(B75+1>=$J$17,0,M63*(1+Captura!$D$35))","v":0},null,{"$f":"IF(B75=J$17,Captura!$K$29,0)","v":0},{"$f":"SUM(D75:F75,I75:N75)*Captura!$C$19","v":0},0,null,null,12,47,0,null,{"$f":"+V74*Captura!$O$9/12","v":0},0,0,{"$f":"IF(U75=J$17,Captura!$K$33,0)","v":0},null,{"$f":"IF(U75+1>=$J$17,0,AC63*(1+Captura!$D$35))","v":0},{"$f":"IF(U75+1>=$J$17,0,AD63*(1+Captura!$D$35))","v":0},{"$f":"IF(U75+1>=$J$17,0,AE63*(1+Captura!$D$35))","v":0},null,{"$f":"+(W75+AB75+AC75+AD75+AE75+AF75)*Captura!$C$19","v":0},0,null,0,0]
[null,48,"2030-03-04",{"$f":"IF(B76<J$17,Captura!$K$16,0)","v":0},null,null,null,0,null,null,{"$f":"IF(B76+1>=$J$17,0,K64*(1+Captura!$D$35))","v":0},{"$f":"IF(B76+1>=$J$17,0,L64*(1+Captura!$D$35))","v":0},{"$f":"IF(B76+1>=$J$17,0,M64*(1+Captura!$D$35))","v":0},null,{"$f":"IF(B76=J$17,Captura!$K$29,0)","v":0},{"$f":"SUM(D76:F76,I76:N76)*Captura!$C$19","v":0},0,null,null,1,48,0,null,{"$f":"+V75*Captura!$O$9/12","v":0},0,0,{"$f":"IF(U76=J$17,Captura!$K$33,0)","v":0},null,{"$f":"IF(U76+1>=$J$17,0,AC64*(1+Captura!$D$35))","v":0},{"$f":"IF(U76+1>=$J$17,0,AD64*(1+Captura!$D$35))","v":0},{"$f":"IF(U76+1>=$J$17,0,AE64*(1+Captura!$D$35))","v":0},null,{"$f":"+(W76+AB76+AC76+AD76+AE76+AF76)*Captura!$C$19","v":0},0,null,0,0]
[null,49,"2030-04-04",{"$f":"IF(B77<J$17,Captura!$K$16,0)","v":0},null,null,null,0,null,null,{"$f":"IF(B77+1>=$J$17,0,K65*(1+Captura!$D$35))","v":0},{"$f":"IF(B77+1>=$J$17,0,L65*(1+Captura!$D$35))","v":0},{"$f":"IF(B77+1>=$J$17,0,M65*(1+Captura!$D$35))","v":0},null,{"$f":"IF(B77=J$17,Captura!$K$29,0)","v":0},{"$f":"SUM(D77:F77,I77:N77)*Captura!$C$19","v":0},0,null,null,2,49,0,null,{"$f":"+V76*Captura!$O$9/12","v":0},0,0,{"$f":"IF(U77=J$17,Captura!$K$33,0)","v":0},null,{"$f":"IF(U77+1>=$J$17,0,AC65*(1+Captura!$D$35))","v":0},{"$f":"IF(U77+1>=$J$17,0,AD65*(1+Captura!$D$35))","v":0},{"$f":"IF(U77+1>=$J$17,0,AE65*(1+Captura!$D$35))","v":0},null,{"$f":"+(W77+AB77+AC77+AD77+AE77+AF77)*Captura!$C$19","v":0},0,null,0,0]
[null,50,"2030-05-04",{"$f":"IF(B78<J$17,Captura!$K$16,0)","v":0},null,null,null,0,null,null,{"$f":"IF(B78+1>=$J$17,0,K66*(1+Captura!$D$35))","v":0},{"$f":"IF(B78+1>=$J$17,0,L66*(1+Captura!$D$35))","v":0},{"$f":"IF(B78+1>=$J$17,0,M66*(1+Captura!$D$35))","v":0},null,{"$f":"IF(B78=J$17,Captura!$K$29,0)","v":0},{"$f":"SUM(D78:F78,I78:N78)*Captura!$C$19","v":0},0,null,null,3,50,0,null,{"$f":"+V77*Captura!$O$9/12","v":0},0,0,{"$f":"IF(U78=J$17,Captura!$K$33,0)","v":0},null,{"$f":"IF(U78+1>=$J$17,0,AC66*(1+Captura!$D$35))","v":0},{"$f":"IF(U78+1>=$J$17,0,AD66*(1+Captura!$D$35))","v":0},{"$f":"IF(U78+1>=$J$17,0,AE66*(1+Captura!$D$35))","v":0},null,{"$f":"+(W78+AB78+AC78+AD78+AE78+AF78)*Captura!$C$19","v":0},0,null,0,0]
[null,51,"2030-06-04",{"$f":"IF(B79<J$17,Captura!$K$16,0)","v":0},null,null,null,0,null,null,{"$f":"IF(B79+1>=$J$17,0,K67*(1+Captura!$D$35))","v":0},{"$f":"IF(B79+1>=$J$17,0,L67*(1+Captura!$D$35))","v":0},{"$f":"IF(B79+1>=$J$17,0,M67*(1+Captura!$D$35))","v":0},null,{"$f":"IF(B79=J$17,Captura!$K$29,0)","v":0},{"$f":"SUM(D79:F79,I79:N79)*Captura!$C$19","v":0},0,null,null,4,51,0,null,{"$f":"+V78*Captura!$O$9/12","v":0},0,0,{"$f":"IF(U79=J$17,Captura!$K$33,0)","v":0},null,{"$f":"IF(U79+1>=$J$17,0,AC67*(1+Captura!$D$35))","v":0},{"$f":"IF(U79+1>=$J$17,0,AD67*(1+Captura!$D$35))","v":0},{"$f":"IF(U79+1>=$J$17,0,AE67*(1+Captura!$D$35))","v":0},null,{"$f":"+(W79+AB79+AC79+AD79+AE79+AF79)*Captura!$C$19","v":0},0,null,0,0]
[null,52,"2030-07-04",{"$f":"IF(B80<J$17,Captura!$K$16,0)","v":0},null,null,null,0,null,null,{"$f":"IF(B80+1>=$J$17,0,K68*(1+Captura!$D$35))","v":0},{"$f":"IF(B80+1>=$J$17,0,L68*(1+Captura!$D$35))","v":0},{"$f":"IF(B80+1>=$J$17,0,M68*(1+Captura!$D$35))","v":0},null,{"$f":"IF(B80=J$17,Captura!$K$29,0)","v":0},{"$f":"SUM(D80:F80,I80:N80)*Captura!$C$19","v":0},0,null,null,5,52,0,null,{"$f":"+V79*Captura!$O$9/12","v":0},0,0,{"$f":"IF(U80=J$17,Captura!$K$33,0)","v":0},null,{"$f":"IF(U80+1>=$J$17,0,AC68*(1+Captura!$D$35))","v":0},{"$f":"IF(U80+1>=$J$17,0,AD68*(1+Captura!$D$35))","v":0},{"$f":"IF(U80+1>=$J$17,0,AE68*(1+Captura!$D$35))","v":0},null,{"$f":"+(W80+AB80+AC80+AD80+AE80+AF80)*Captura!$C$19","v":0},0,null,0,0]
[null,53,"2030-08-04",{"$f":"IF(B81<J$17,Captura!$K$16,0)","v":0},null,null,null,0,null,null,{"$f":"IF(B81+1>=$J$17,0,K69*(1+Captura!$D$35))","v":0},{"$f":"IF(B81+1>=$J$17,0,L69*(1+Captura!$D$35))","v":0},{"$f":"IF(B81+1>=$J$17,0,M69*(1+Captura!$D$35))","v":0},null,{"$f":"IF(B81=J$17,Captura!$K$29,0)","v":0},{"$f":"SUM(D81:F81,I81:N81)*Captura!$C$19","v":0},0,null,null,6,53,0,null,{"$f":"+V80*Captura!$O$9/12","v":0},0,0,{"$f":"IF(U81=J$17,Captura!$K$33,0)","v":0},null,{"$f":"IF(U81+1>=$J$17,0,AC69*(1+Captura!$D$35))","v":0},{"$f":"IF(U81+1>=$J$17,0,AD69*(1+Captura!$D$35))","v":0},{"$f":"IF(U81+1>=$J$17,0,AE69*(1+Captura!$D$35))","v":0},null,{"$f":"+(W81+AB81+AC81+AD81+AE81+AF81)*Captura!$C$19","v":0},0,null,0,0]
[null,54,"2030-09-04",{"$f":"IF(B82<J$17,Captura!$K$16,0)","v":0},null,null,null,0,null,null,{"$f":"IF(B82+1>=$J$17,0,K70*(1+Captura!$D$35))","v":0},{"$f":"IF(B82+1>=$J$17,0,L70*(1+Captura!$D$35))","v":0},{"$f":"IF(B82+1>=$J$17,0,M70*(1+Captura!$D$35))","v":0},null,{"$f":"IF(B82=J$17,Captura!$K$29,0)","v":0},{"$f":"SUM(D82:F82,I82:N82)*Captura!$C$19","v":0},0,null,null,7,54,0,null,{"$f":"+V81*Captura!$O$9/12","v":0},0,0,{"$f":"IF(U82=J$17,Captura!$K$33,0)","v":0},null,{"$f":"IF(U82+1>=$J$17,0,AC70*(1+Captura!$D$35))","v":0},{"$f":"IF(U82+1>=$J$17,0,AD70*(1+Captura!$D$35))","v":0},{"$f":"IF(U82+1>=$J$17,0,AE70*(1+Captura!$D$35))","v":0},null,{"$f":"+(W82+AB82+AC82+AD82+AE82+AF82)*Captura!$C$19","v":0},0,null,0,0]
[null,55,"2030-10-04",{"$f":"IF(B83<J$17,Captura!$K$16,0)","v":0},null,null,null,0,null,null,{"$f":"IF(B83+1>=$J$17,0,K71*(1+Captura!$D$35))","v":0},{"$f":"IF(B83+1>=$J$17,0,L71*(1+Captura!$D$35))","v":0},{"$f":"IF(B83+1>=$J$17,0,M71*(1+Captura!$D$35))","v":0},null,{"$f":"IF(B83=J$17,Captura!$K$29,0)","v":0},{"$f":"SUM(D83:F83,I83:N83)*Captura!$C$19","v":0},0,null,null,8,55,0,null,{"$f":"+V82*Captura!$O$9/12","v":0},0,0,{"$f":"IF(U83=J$17,Captura!$K$33,0)","v":0},null,{"$f":"IF(U83+1>=$J$17,0,AC71*(1+Captura!$D$35))","v":0},{"$f":"IF(U83+1>=$J$17,0,AD71*(1+Captura!$D$35))","v":0},{"$f":"IF(U83+1>=$J$17,0,AE71*(1+Captura!$D$35))","v":0},null,{"$f":"+(W83+AB83+AC83+AD83+AE83+AF83)*Captura!$C$19","v":0},0,null,0,0]
[null,56,"2030-11-04",{"$f":"IF(B84<J$17,Captura!$K$16,0)","v":0},null,null,null,0,null,null,{"$f":"IF(B84+1>=$J$17,0,K72*(1+Captura!$D$35))","v":0},{"$f":"IF(B84+1>=$J$17,0,L72*(1+Captura!$D$35))","v":0},{"$f":"IF(B84+1>=$J$17,0,M72*(1+Captura!$D$35))","v":0},null,{"$f":"IF(B84=J$17,Captura!$K$29,0)","v":0},{"$f":"SUM(D84:F84,I84:N84)*Captura!$C$19","v":0},0,null,null,9,56,0,null,{"$f":"+V83*Captura!$O$9/12","v":0},0,0,{"$f":"IF(U84=J$17,Captura!$K$33,0)","v":0},null,{"$f":"IF(U84+1>=$J$17,0,AC72*(1+Captura!$D$35))","v":0},{"$f":"IF(U84+1>=$J$17,0,AD72*(1+Captura!$D$35))","v":0},{"$f":"IF(U84+1>=$J$17,0,AE72*(1+Captura!$D$35))","v":0},null,{"$f":"+(W84+AB84+AC84+AD84+AE84+AF84)*Captura!$C$19","v":0},0,null,0,0]
[null,57,"2030-12-04",{"$f":"IF(B85<J$17,Captura!$K$16,0)","v":0},null,null,null,0,null,null,{"$f":"IF(B85+1>=$J$17,0,K73*(1+Captura!$D$35))","v":0},{"$f":"IF(B85+1>=$J$17,0,L73*(1+Captura!$D$35))","v":0},{"$f":"IF(B85+1>=$J$17,0,M73*(1+Captura!$D$35))","v":0},null,{"$f":"IF(B85=J$17,Captura!$K$29,0)","v":0},{"$f":"SUM(D85:F85,I85:N85)*Captura!$C$19","v":0},0,null,null,10,57,0,null,{"$f":"+V84*Captura!$O$9/12","v":0},0,0,{"$f":"IF(U85=J$17,Captura!$K$33,0)","v":0},null,{"$f":"IF(U85+1>=$J$17,0,AC73*(1+Captura!$D$35))","v":0},{"$f":"IF(U85+1>=$J$17,0,AD73*(1+Captura!$D$35))","v":0},{"$f":"IF(U85+1>=$J$17,0,AE73*(1+Captura!$D$35))","v":0},null,{"$f":"+(W85+AB85+AC85+AD85+AE85+AF85)*Captura!$C$19","v":0},0,null,0,0]
[null,58,"2031-01-04",{"$f":"IF(B86<J$17,Captura!$K$16,0)","v":0},null,null,null,0,null,null,{"$f":"IF(B86+1>=$J$17,0,K74*(1+Captura!$D$35))","v":0},{"$f":"IF(B86+1>=$J$17,0,L74*(1+Captura!$D$35))","v":0},{"$f":"IF(B86+1>=$J$17,0,M74*(1+Captura!$D$35))","v":0},null,{"$f":"IF(B86=J$17,Captura!$K$29,0)","v":0},{"$f":"SUM(D86:F86,I86:N86)*Captura!$C$19","v":0},0,null,null,11,58,0,null,{"$f":"+V85*Captura!$O$9/12","v":0},0,0,{"$f":"IF(U86=J$17,Captura!$K$33,0)","v":0},null,{"$f":"IF(U86+1>=$J$17,0,AC74*(1+Captura!$D$35))","v":0},{"$f":"IF(U86+1>=$J$17,0,AD74*(1+Captura!$D$35))","v":0},{"$f":"IF(U86+1>=$J$17,0,AE74*(1+Captura!$D$35))","v":0},null,{"$f":"+(W86+AB86+AC86+AD86+AE86+AF86)*Captura!$C$19","v":0},0,null,0,0]
[null,59,"2031-02-04",{"$f":"IF(B87<J$17,Captura!$K$16,0)","v":0},null,null,null,0,null,null,{"$f":"IF(B87+1>=$J$17,0,K75*(1+Captura!$D$35))","v":0},{"$f":"IF(B87+1>=$J$17,0,L75*(1+Captura!$D$35))","v":0},{"$f":"IF(B87+1>=$J$17,0,M75*(1+Captura!$D$35))","v":0},null,{"$f":"IF(B87=J$17,Captura!$K$29,0)","v":0},{"$f":"SUM(D87:F87,I87:N87)*Captura!$C$19","v":0},0,null,null,12,59,0,null,{"$f":"+V86*Captura!$O$9/12","v":0},0,0,{"$f":"IF(U87=J$17,Captura!$K$33,0)","v":0},null,{"$f":"IF(U87+1>=$J$17,0,AC75*(1+Captura!$D$35))","v":0},{"$f":"IF(U87+1>=$J$17,0,AD75*(1+Captura!$D$35))","v":0},{"$f":"IF(U87+1>=$J$17,0,AE75*(1+Captura!$D$35))","v":0},null,{"$f":"+(W87+AB87+AC87+AD87+AE87+AF87)*Captura!$C$19","v":0},0,null,0,0]
[null,60,"2031-03-04",{"$f":"IF(B88<J$17,Captura!$K$16,0)","v":0},null,null,null,0,null,null,{"$f":"IF(B88+1>=$J$17,0,K76*(1+Captura!$D$35))","v":0},{"$f":"IF(B88+1>=$J$17,0,L76*(1+Captura!$D$35))","v":0},{"$f":"IF(B88+1>=$J$17,0,M76*(1+Captura!$D$35))","v":0},null,{"$f":"IF(B88=J$17,Captura!$K$29,0)","v":0},{"$f":"SUM(D88:F88,I88:N88)*Captura!$C$19","v":0},0,null,null,1,60,0,null,{"$f":"+V87*Captura!$O$9/12","v":0},0,0,{"$f":"IF(U88=J$17,Captura!$K$33,0)","v":0},null,{"$f":"IF(U88+1>=$J$17,0,AC76*(1+Captura!$D$35))","v":0},{"$f":"IF(U88+1>=$J$17,0,AD76*(1+Captura!$D$35))","v":0},{"$f":"IF(U88+1>=$J$17,0,AE76*(1+Captura!$D$35))","v":0},null,{"$f":"+(W88+AB88+AC88+AD88+AE88+AF88)*Captura!$C$19","v":0},0,null,0,0]
[]
[]
[]
[null,"Notas:"]
[null,"1. Esta cotización no es una autorización y no representa ninguna obligación para Leasing Mobile de México, S. A. de C. V."]
[null,"2. La información descrita en el presente documento está sujeta a cambios sin previo aviso."]
[null,"3. Esta cotización no considera gastos que el equipo requiera para su adquisición, uso o mantenimiento."]
[null,"4. Las rentas en depósito serán devueltas al cumplimiento de todas las obligaciones contractauales del Arrendatario."]
[]
[]
[]
[]
[]
[]
[]
[]
[]
[]
[null,"__________________________________"]
[null,"Leasing Mobile de Mexico, SA de CV"]
[null,{"$f":"+Captura!D31","v":"xxxx"}]
[null,{"$f":"+Captura!D32","v":"xxxx"}]
[null,{"$f":"+Captura!D33","v":"xxxx"}]

{"sheet":"Plazo 2","index":7,"n_rows":111,"n_cols":37,"rows_kept":111,"cut":false,"hidden":true,"merged":[[112,1,112,17],[22,4,22,5],[23,4,23,5],[106,1,106,16],[107,1,107,16],[108,1,108,16],[109,1,109,16],[16,35,16,36],[17,16,19,16],[18,4,20,5],[18,35,18,36],[110,1,110,16],[21,4,21,5],[12,10,12,16],[14,1,14,16],[3,15,3,16],[6,1,6,16],[7,1,7,16],[9,15,9,16],[11,10,11,16]]}
[]
[]
[]
[]
[]
[]
[null,"Cotización"]
[null,"Arrendamiento Puro"]
[]
[null,null,null,null,null,null,null,null,null,null,null,null,null,null,null,{"$f":"+Captura!N3","v":"2026-03-04"}]
[]
[null,"Cliente:",null,null,{"$f":"+Captura!D7","v":0},null,null,null,null,"Teléfono",{"$f":"+Captura!D9","v":0}]
[null,"Atención:",null,null,{"$f":"+Captura!D8","v":0},null,null,null,null,"E-mail",{"$f":"+Captura!D10","v":0}]
[null,null,null,null,null,null,null,null,null,null,null,null,null,null,null,null,{"$f":"+Captura!O40","v":"v. 20240220"}]
[]
[]
[null,"Tipo de equipo",null,null,{"$f":"+Captura!T7","v":"Vehículo utilitario"},null,null,"Plazo del arrendamiento",null,{"$f":"+Captura!L13","v":24},null,"Gestoría y Registro",null,{"$f":"+Captura!F23","v":"Pago único"},null,null,null,null,null,null,null,null,null,null,null,null,null,null,null,null,null,null,null,null,null,"Valor presente de flujos"]
[null,"Estado del equipo",null,null,{"$f":"+Captura!T17","v":"Nuevo"},null,null,"No. de rentas en depósito",null,{"$f":"+Captura!K8","v":1},null,"Equipo de geolocalizacióon",null,{"$f":"+Captura!F24","v":"Pago único"},null,null,{"$f":"+Captura!L36","v":0},null,null,null,null,null,null,null,null,null,null,null,null,null,null,null,null,null,null,{"$f":"NPV(Captura!$D$35/12,AJ29:AJ88)+AJ28","v":{"$error":"#DIV/0!"}},{"$f":"NPV(Captura!$D$35/12,AK29:AK88)+AK28","v":-759.72924467997132}]
[null,"Descripción",null,null,{"$f":"+Captura!D15","v":0},null,null,"Comisión de apertura",null,{"$f":"+Captura!K9","v":0.03},null,"Seguro de daños",null,{"$f":"+Captura!T26","v":"Pago en renta"},null,null,null,null,null,null,null,null,null,null,null,null,null,null,null,null,null,null,null,null,null,"Tasa Interna de Retorno"]
[null,null,null,null,null,null,null,"Anticipo",null,{"$f":"+Captura!K10","v":0},null,"Placas y Tenencia",null,{"$f":"+Captura!T33","v":"Pago anual"},null,null,null,null,null,null,null,null,null,null,null,null,null,null,null,null,null,null,null,null,null,{"$f":"IRR(AJ28:AJ88,0.01)*12","v":{"$error":"#VALUE!"}},{"$f":"IRR(AK28:AK88,0.01)*12","v":{"$error":"#DIV/0!"}}]
[null,null,null,null,null,null,null,"Residual estimado",null,"Valor mercado",null,"Servicio de geolocalización",null,{"$f":"+Captura!T40","v":"Pago anual"},null,null,{"$f":"+Captura!L37","v":"Positivo"},null,null,null,null,null,null,null,null,null,null,null,null,null,null,null,null,null,null,"Capital Req.",{"$f":"+Captura!L34","v":0}]
[null,"Valor factura sin IVA",null,null,{"$f":"+Captura!G18","v":0},null,null,null,null,null,null,{"$f":"+Captura!I25","v":"Otro"},null,{"$f":"+Captura!F28","v":0},null,null,null,null,null,null,null,null,null,null,null,null,null,null,null,null,null,null,null,null,null,"VP / CR",{"$f":"+(AJ18+AK18)/AK21","v":{"$error":"#DIV/0!"}}]
[null,"IVA",null,null,{"$f":"+Captura!G19","v":0},null,null,null,null,null,null,null,null,null,null,null,"Regresar"]
[null,"Valor factua con IVA",null,null,{"$f":"+Captura!G20","v":0},null,null,null,null,null,null,null,null,null,null,null,null,null,null,null,null,null,null,null,null,null,null,null,null,null,null,null,null,null,null,"Indicador anualizado",{"$f":"+AK22/J17*12","v":{"$error":"#DIV/0!"}}]
[]
[null,"Periodo","Mes","Renta","Anticipo","Comisión de apertura","Rentas en depósito","Devolución de rentas en depósito","Gestoría y Registro","Equipo de geo localización","Seguro de daños","Placas y Tenencia","Servicio de geo localización",{"$f":"+L22","v":"Otro"},"Residual estimado","IVA","TOTAL",null,null,"Mes","Periodo","Fondeo","Comisión de apertura","Intereses","Capital","Pago","Bullet","Equipo de geo localización","Seguro de daños","Placas y Tenencia","Servicio de geo localización","Otro","IVA","TOTAL",null,"Flujo Activo sin IVA","Flujo Pasivo sin IVA"]
[]
[null,0,{"$f":"+P10","v":"2026-03-04"},{"$f":"+Captura!L16+Resumen!J29+Resumen!J30","v":{"$error":"#DIV/0!"}},{"$f":"+Captura!K10","v":0},{"$f":"+Captura!L18","v":0},{"$f":"+Captura!L19","v":0},{"$f":"IF(B28=J$17,-G$28,0)","v":0},{"$f":"+Captura!L20","v":0},{"$f":"+Captura!L21","v":0},{"$f":"+Captura!L22","v":0},{"$f":"+Captura!L23","v":0},{"$f":"+Captura!L24","v":0},{"$f":"+Captura!L25","v":0},{"$f":"IF(B28=J$17,Captura!$L$29,0)","v":0},{"$f":"SUM(D28:F28,I28:N28)*Captura!$C$19","v":{"$error":"#DIV/0!"}},{"$f":"SUM(D28:P28)-O28","v":{"$error":"#DIV/0!"}},null,null,1,{"$f":"+B28","v":0},{"$f":"+Captura!O8","v":0},{"$f":"+Captura!L31","v":0},null,null,null,null,{"$f":"+J28","v":0},{"$f":"+Captura!G25","v":0},{"$f":"+Captura!G26","v":0},{"$f":"+Captura!G27","v":380},{"$f":"+N28","v":0},{"$f":"+(W28+AB28+AC28+AD28+AE28+AF28)*Captura!$C$19","v":60.800000000000004},{"$f":"SUM(W28,Z28:AG28)","v":440.8},null,{"$f":"-E22+(Q28-P28)+O28","v":{"$error":"#DIV/0!"}},{"$f":"+V28-(AH28-AG28)","v":-380}]
[null,1,{"$f":"EDATE(C28,1)","v":"2026-04-04"},{"$f":"IF(B29<J$17,Captura!$L$16,0)+Resumen!$J$29+Resumen!$J$30","v":{"$error":"#DIV/0!"}},null,null,null,0,null,null,0,0,0,null,{"$f":"IF(B29=J$17,Captura!$L$29,0)","v":0},{"$f":"SUM(D29:F29,I29:N29)*Captura!$C$19","v":{"$error":"#DIV/0!"}},{"$f":"SUM(D29:P29)-O29","v":{"$error":"#DIV/0!"}},null,null,{"$f":"IF(T28=12,1,T28+1)","v":2},{"$f":"+B29","v":1},{"$f":"+V28-Y29-AA29","v":0},null,{"$f":"+V28*Captura!$O$9/12","v":0},{"$f":"+Z29-X29","v":0},{"$f":"+Captura!L30","v":0},{"$f":"IF(U29=J$17,Captura!$L$33,0)","v":0},null,0,0,0,null,{"$f":"+(W29+AB29+AC29+AD29+AE29+AF29)*Captura!$C$19","v":0},{"$f":"SUM(W29,Z29:AG29)","v":0},null,{"$f":"Q29-P29+O29","v":{"$error":"#DIV/0!"}},{"$f":"-(AH29-AG29)","v":0}]
[null,2,{"$f":"EDATE(C29,1)","v":"2026-05-04"},{"$f":"IF(B30<J$17,Captura!$L$16,0)+Resumen!$J$29+Resumen!$J$30","v":{"$error":"#DIV/0!"}},null,null,null,0,null,null,0,0,0,null,{"$f":"IF(B30=J$17,Captura!$L$29,0)","v":0},{"$f":"SUM(D30:F30,I30:N30)*Captura!$C$19","v":{"$error":"#DIV/0!"}},{"$error":"#DIV/0!"},null,null,{"$f":"IF(T29=12,1,T29+1)","v":3},2,{"$f":"+V29-Y30-AA30","v":0},null,{"$f":"+V29*Captura!$O$9/12","v":0},{"$f":"+Z30-X30","v":0},{"$f":"IF(U30>J$17,0,Z29)","v":0},{"$f":"IF(U30=J$17,Captura!$L$33,0)","v":0},null,0,0,0,null,{"$f":"+(W30+AB30+AC30+AD30+AE30+AF30)*Captura!$C$19","v":0},0,null,{"$f":"Q30-P30+O30","v":{"$error":"#DIV/0!"}},{"$f":"-(AH30-AG30)","v":0}]
[null,3,"2026-06-04",{"$f":"IF(B31<J$17,Captura!$L$16,0)+Resumen!$J$29+Resumen!$J$30","v":{"$error":"#DIV/0!"}},null,null,null,0,null,null,0,0,0,null,{"$f":"IF(B31=J$17,Captura!$L$29,0)","v":0},{"$f":"SUM(D31:F31,I31:N31)*Captura!$C$19","v":{"$error":"#DIV/0!"}},{"$error":"#DIV/0!"},null,null,4,3,0,null,{"$f":"+V30*Captura!$O$9/12","v":0},0,{"$f":"IF(U31>J$17,0,Z30)","v":0},{"$f":"IF(U31=J$17,Captura!$L$33,0)","v":0},null,0,0,0,null,{"$f":"+(W31+AB31+AC31+AD31+AE31+AF31)*Captura!$C$19","v":0},0,null,{"$error":"#DIV/0!"},0]
[null,4,"2026-07-04",{"$f":"IF(B32<J$17,Captura!$L$16,0)+Resumen!$J$29+Resumen!$J$30","v":{"$error":"#DIV/0!"}},null,null,null,0,null,null,0,0,0,null,{"$f":"IF(B32=J$17,Captura!$L$29,0)","v":0},{"$f":"SUM(D32:F32,I32:N32)*Captura!$C$19","v":{"$error":"#DIV/0!"}},{"$error":"#DIV/0!"},null,null,5,4,0,null,{"$f":"+V31*Captura!$O$9/12","v":0},0,0,{"$f":"IF(U32=J$17,Captura!$L$33,0)","v":0},null,0,0,0,null,{"$f":"+(W32+AB32+AC32+AD32+AE32+AF32)*Captura!$C$19","v":0},0,null,{"$error":"#DIV/0!"},0]
[null,5,"2026-08-04",{"$f":"IF(B33<J$17,Captura!$L$16,0)+Resumen!$J$29+Resumen!$J$30","v":{"$error":"#DIV/0!"}},null,null,null,0,null,null,0,0,0,null,{"$f":"IF(B33=J$17,Captura!$L$29,0)","v":0},{"$f":"SUM(D33:F33,I33:N33)*Captura!$C$19","v":{"$error":"#DIV/0!"}},{"$error":"#DIV/0!"},null,null,6,5,0,null,{"$f":"+V32*Captura!$O$9/12","v":0},0,0,{"$f":"IF(U33=J$17,Captura!$L$33,0)","v":0},null,0,0,0,null,{"$f":"+(W33+AB33+AC33+AD33+AE33+AF33)*Captura!$C$19","v":0},0,null,{"$error":"#DIV/0!"},0]
[null,6,"2026-09-04",{"$f":"IF(B34<J$17,Captura!$L$16,0)+Resumen!$J$29+Resumen!$J$30","v":{"$error":"#DIV/0!"}},null,null,null,0,null,null,0,0,0,null,{"$f":"IF(B34=J$17,Captura!$L$29,0)","v":0},{"$f":"SUM(D34:F34,I34:N34)*Captura!$C$19","v":{"$error":"#DIV/0!"}},{"$error":"#DIV/0!"},null,null,7,6,0,null,{"$f":"+V33*Captura!$O$9/12","v":0},0,0,{"$f":"IF(U34=J$17,Captura!$L$33,0)","v":0},null,0,0,0,null,{"$f":"+(W34+AB34+AC34+AD34+AE34+AF34)*Captura!$C$19","v":0},0,null,{"$error":"#DIV/0!"},0]
[null,7,"2026-10-04",{"$f":"IF(B35<J$17,Captura!$L$16,0)+Resumen!$J$29+Resumen!$J$30","v":{"$error":"#DIV/0!"}},null,null,null,0,null,null,0,0,0,null,{"$f":"IF(B35=J$17,Captura!$L$29,0)","v":0},{"$f":"SUM(D35:F35,I35:N35)*Captura!$C$19","v":{"$error":"#DIV/0!"}},{"$error":"#DIV/0!"},null,null,8,7,0,null,{"$f":"+V34*Captura!$O$9/12","v":0},0,0,{"$f":"IF(U35=J$17,Captura!$L$33,0)","v":0},null,0,0,0,null,{"$f":"+(W35+AB35+AC35+AD35+AE35+AF35)*Captura!$C$19","v":0},0,null,{"$error":"#DIV/0!"},0]
[null,8,"2026-11-04",{"$f":"IF(B36<J$17,Captura!$L$16,0)+Resumen!$J$29+Resumen!$J$30","v":{"$error":"#DIV/0!"}},null,null,null,0,null,null,0,0,0,null,{"$f":"IF(B36=J$17,Captura!$L$29,0)","v":0},{"$f":"SUM(D36:F36,I36:N36)*Captura!$C$19","v":{"$error":"#DIV/0!"}},{"$error":"#DIV/0!"},null,null,9,8,0,null,{"$f":"+V35*Captura!$O$9/12","v":0},0,0,{"$f":"IF(U36=J$17,Captura!$L$33,0)","v":0},null,0,0,0,null,{"$f":"+(W36+AB36+AC36+AD36+AE36+AF36)*Captura!$C$19","v":0},0,null,{"$error":"#DIV/0!"},0]
[null,9,"2026-12-04",{"$f":"IF(B37<J$17,Captura!$L$16,0)+Resumen!$J$29+Resumen!$J$30","v":{"$error":"#DIV/0!"}},null,null,null,0,null,null,0,0,0,null,{"$f":"IF(B37=J$17,Captura!$L$29,0)","v":0},{"$f":"SUM(D37:F37,I37:N37)*Captura!$C$19","v":{"$error":"#DIV/0!"}},{"$error":"#DIV/0!"},null,null,10,9,0,null,{"$f":"+V36*Captura!$O$9/12","v":0},0,0,{"$f":"IF(U37=J$17,Captura!$L$33,0)","v":0},null,0,0,0,null,{"$f":"+(W37+AB37+AC37+AD37+AE37+AF37)*Captura!$C$19","v":0},0,null,{"$error":"#DIV/0!"},0]
[null,10,"2027-01-04",{"$f":"IF(B38<J$17,Captura!$L$16,0)+Resumen!$J$29+Resumen!$J$30","v":{"$error":"#DIV/0!"}},null,null,null,0,null,null,0,0,0,null,{"$f":"IF(B38=J$17,Captura!$L$29,0)","v":0},{"$f":"SUM(D38:F38,I38:N38)*Captura!$C$19","v":{"$error":"#DIV/0!"}},{"$error":"#DIV/0!"},null,null,11,10,0,null,{"$f":"+V37*Captura!$O$9/12","v":0},0,0,{"$f":"IF(U38=J$17,Captura!$L$33,0)","v":0},null,0,0,0,null,{"$f":"+(W38+AB38+AC38+AD38+AE38+AF38)*Captura!$C$19","v":0},0,null,{"$error":"#DIV/0!"},0]
[null,11,"2027-02-04",{"$f":"IF(B39<J$17,Captura!$L$16,0)+Resumen!$J$29+Resumen!$J$30","v":{"$error":"#DIV/0!"}},null,null,null,0,null,null,0,0,0,null,{"$f":"IF(B39=J$17,Captura!$L$29,0)","v":0},{"$f":"SUM(D39:F39,I39:N39)*Captura!$C$19","v":{"$error":"#DIV/0!"}},{"$error":"#DIV/0!"},null,null,12,11,0,null,{"$f":"+V38*Captura!$O$9/12","v":0},0,0,{"$f":"IF(U39=J$17,Captura!$L$33,0)","v":0},null,0,0,0,null,{"$f":"+(W39+AB39+AC39+AD39+AE39+AF39)*Captura!$C$19","v":0},0,null,{"$error":"#DIV/0!"},0]
[null,12,"2027-03-04",{"$f":"IF(B40<J$17,Captura!$L$16,0)+Resumen!$J$29+Resumen!$J$30","v":{"$error":"#DIV/0!"}},null,null,null,0,null,null,{"$f":"IF(B40+1>=$J$17,0,K28*(1+Captura!$D$35))","v":0},{"$f":"IF(B40+1>=$J$17,0,L28*(1+Captura!$D$35))","v":0},{"$f":"IF(B40+1>=$J$17,0,M28*(1+Captura!$D$35))","v":0},null,{"$f":"IF(B40=J$17,Captura!$L$29,0)","v":0},{"$f":"SUM(D40:F40,I40:N40)*Captura!$C$19","v":{"$error":"#DIV/0!"}},{"$error":"#DIV/0!"},null,null,1,12,0,null,{"$f":"+V39*Captura!$O$9/12","v":0},0,0,{"$f":"IF(U40=J$17,Captura!$L$33,0)","v":0},null,{"$f":"IF(U40+1>=$J$17,0,AC28*(1+Captura!$D$35))","v":0},{"$f":"IF(U40+1>=$J$17,0,AD28*(1+Captura!$D$35))","v":0},{"$f":"IF(U40+1>=$J$17,0,AE28*(1+Captura!$D$35))","v":395.2},null,{"$f":"+(W40+AB40+AC40+AD40+AE40+AF40)*Captura!$C$19","v":63.231999999999999},458.43200000000002,null,{"$error":"#DIV/0!"},-395.20000000000005]
[null,13,"2027-04-04",{"$f":"IF(B41<J$17,Captura!$L$16,0)+Resumen!$J$29+Resumen!$J$30","v":{"$error":"#DIV/0!"}},null,null,null,0,null,null,{"$f":"IF(B41+1>=$J$17,0,K29*(1+Captura!$D$35))","v":0},{"$f":"IF(B41+1>=$J$17,0,L29*(1+Captura!$D$35))","v":0},{"$f":"IF(B41+1>=$J$17,0,M29*(1+Captura!$D$35))","v":0},null,{"$f":"IF(B41=J$17,Captura!$L$29,0)","v":0},{"$f":"SUM(D41:F41,I41:N41)*Captura!$C$19","v":{"$error":"#DIV/0!"}},{"$error":"#DIV/0!"},null,null,2,13,0,null,{"$f":"+V40*Captura!$O$9/12","v":0},0,0,{"$f":"IF(U41=J$17,Captura!$L$33,0)","v":0},null,{"$f":"IF(U41+1>=$J$17,0,AC29*(1+Captura!$D$35))","v":0},{"$f":"IF(U41+1>=$J$17,0,AD29*(1+Captura!$D$35))","v":0},{"$f":"IF(U41+1>=$J$17,0,AE29*(1+Captura!$D$35))","v":0},null,{"$f":"+(W41+AB41+AC41+AD41+AE41+AF41)*Captura!$C$19","v":0},0,null,{"$error":"#DIV/0!"},0]
[null,14,"2027-05-04",{"$f":"IF(B42<J$17,Captura!$L$16,0)+Resumen!$J$29+Resumen!$J$30","v":{"$error":"#DIV/0!"}},null,null,null,0,null,null,{"$f":"IF(B42+1>=$J$17,0,K30*(1+Captura!$D$35))","v":0},{"$f":"IF(B42+1>=$J$17,0,L30*(1+Captura!$D$35))","v":0},{"$f":"IF(B42+1>=$J$17,0,M30*(1+Captura!$D$35))","v":0},null,{"$f":"IF(B42=J$17,Captura!$L$29,0)","v":0},{"$f":"SUM(D42:F42,I42:N42)*Captura!$C$19","v":{"$error":"#DIV/0!"}},{"$error":"#DIV/0!"},null,null,3,14,0,null,{"$f":"+V41*Captura!$O$9/12","v":0},0,0,{"$f":"IF(U42=J$17,Captura!$L$33,0)","v":0},null,{"$f":"IF(U42+1>=$J$17,0,AC30*(1+Captura!$D$35))","v":0},{"$f":"IF(U42+1>=$J$17,0,AD30*(1+Captura!$D$35))","v":0},{"$f":"IF(U42+1>=$J$17,0,AE30*(1+Captura!$D$35))","v":0},null,{"$f":"+(W42+AB42+AC42+AD42+AE42+AF42)*Captura!$C$19","v":0},0,null,{"$error":"#DIV/0!"},0]
[null,15,"2027-06-04",{"$f":"IF(B43<J$17,Captura!$L$16,0)+Resumen!$J$29+Resumen!$J$30","v":{"$error":"#DIV/0!"}},null,null,null,0,null,null,{"$f":"IF(B43+1>=$J$17,0,K31*(1+Captura!$D$35))","v":0},{"$f":"IF(B43+1>=$J$17,0,L31*(1+Captura!$D$35))","v":0},{"$f":"IF(B43+1>=$J$17,0,M31*(1+Captura!$D$35))","v":0},null,{"$f":"IF(B43=J$17,Captura!$L$29,0)","v":0},{"$f":"SUM(D43:F43,I43:N43)*Captura!$C$19","v":{"$error":"#DIV/0!"}},{"$error":"#DIV/0!"},null,null,4,15,0,null,{"$f":"+V42*Captura!$O$9/12","v":0},0,0,{"$f":"IF(U43=J$17,Captura!$L$33,0)","v":0},null,{"$f":"IF(U43+1>=$J$17,0,AC31*(1+Captura!$D$35))","v":0},{"$f":"IF(U43+1>=$J$17,0,AD31*(1+Captura!$D$35))","v":0},{"$f":"IF(U43+1>=$J$17,0,AE31*(1+Captura!$D$35))","v":0},null,{"$f":"+(W43+AB43+AC43+AD43+AE43+AF43)*Captura!$C$19","v":0},0,null,{"$error":"#DIV/0!"},0]
[null,16,"2027-07-04",{"$f":"IF(B44<J$17,Captura!$L$16,0)+Resumen!$J$29+Resumen!$J$30","v":{"$error":"#DIV/0!"}},null,null,null,0,null,null,{"$f":"IF(B44+1>=$J$17,0,K32*(1+Captura!$D$35))","v":0},{"$f":"IF(B44+1>=$J$17,0,L32*(1+Captura!$D$35))","v":0},{"$f":"IF(B44+1>=$J$17,0,M32*(1+Captura!$D$35))","v":0},null,{"$f":"IF(B44=J$17,Captura!$L$29,0)","v":0},{"$f":"SUM(D44:F44,I44:N44)*Captura!$C$19","v":{"$error":"#DIV/0!"}},{"$error":"#DIV/0!"},null,null,5,16,0,null,{"$f":"+V43*Captura!$O$9/12","v":0},0,0,{"$f":"IF(U44=J$17,Captura!$L$33,0)","v":0},null,{"$f":"IF(U44+1>=$J$17,0,AC32*(1+Captura!$D$35))","v":0},{"$f":"IF(U44+1>=$J$17,0,AD32*(1+Captura!$D$35))","v":0},{"$f":"IF(U44+1>=$J$17,0,AE32*(1+Captura!$D$35))","v":0},null,{"$f":"+(W44+AB44+AC44+AD44+AE44+AF44)*Captura!$C$19","v":0},0,null,{"$error":"#DIV/0!"},0]
[null,17,"2027-08-04",{"$f":"IF(B45<J$17,Captura!$L$16,0)+Resumen!$J$29+Resumen!$J$30","v":{"$error":"#DIV/0!"}},null,null,null,0,null,null,{"$f":"IF(B45+1>=$J$17,0,K33*(1+Captura!$D$35))","v":0},{"$f":"IF(B45+1>=$J$17,0,L33*(1+Captura!$D$35))","v":0},{"$f":"IF(B45+1>=$J$17,0,M33*(1+Captura!$D$35))","v":0},null,{"$f":"IF(B45=J$17,Captura!$L$29,0)","v":0},{"$f":"SUM(D45:F45,I45:N45)*Captura!$C$19","v":{"$error":"#DIV/0!"}},{"$error":"#DIV/0!"},null,null,6,17,0,null,{"$f":"+V44*Captura!$O$9/12","v":0},0,0,{"$f":"IF(U45=J$17,Captura!$L$33,0)","v":0},null,{"$f":"IF(U45+1>=$J$17,0,AC33*(1+Captura!$D$35))","v":0},{"$f":"IF(U45+1>=$J$17,0,AD33*(1+Captura!$D$35))","v":0},{"$f":"IF(U45+1>=$J$17,0,AE33*(1+Captura!$D$35))","v":0},null,{"$f":"+(W45+AB45+AC45+AD45+AE45+AF45)*Captura!$C$19","v":0},0,null,{"$error":"#DIV/0!"},0]
[null,18,"2027-09-04",{"$f":"IF(B46<J$17,Captura!$L$16,0)+Resumen!$J$29+Resumen!$J$30","v":{"$error":"#DIV/0!"}},null,null,null,0,null,null,{"$f":"IF(B46+1>=$J$17,0,K34*(1+Captura!$D$35))","v":0},{"$f":"IF(B46+1>=$J$17,0,L34*(1+Captura!$D$35))","v":0},{"$f":"IF(B46+1>=$J$17,0,M34*(1+Captura!$D$35))","v":0},null,{"$f":"IF(B46=J$17,Captura!$L$29,0)","v":0},{"$f":"SUM(D46:F46,I46:N46)*Captura!$C$19","v":{"$error":"#DIV/0!"}},{"$error":"#DIV/0!"},null,null,7,18,0,null,{"$f":"+V45*Captura!$O$9/12","v":0},0,0,{"$f":"IF(U46=J$17,Captura!$L$33,0)","v":0},null,{"$f":"IF(U46+1>=$J$17,0,AC34*(1+Captura!$D$35))","v":0},{"$f":"IF(U46+1>=$J$17,0,AD34*(1+Captura!$D$35))","v":0},{"$f":"IF(U46+1>=$J$17,0,AE34*(1+Captura!$D$35))","v":0},null,{"$f":"+(W46+AB46+AC46+AD46+AE46+AF46)*Captura!$C$19","v":0},0,null,{"$error":"#DIV/0!"},0]
[null,19,"2027-10-04",{"$f":"IF(B47<J$17,Captura!$L$16,0)+Resumen!$J$29+Resumen!$J$30","v":{"$error":"#DIV/0!"}},null,null,null,0,null,null,{"$f":"IF(B47+1>=$J$17,0,K35*(1+Captura!$D$35))","v":0},{"$f":"IF(B47+1>=$J$17,0,L35*(1+Captura!$D$35))","v":0},{"$f":"IF(B47+1>=$J$17,0,M35*(1+Captura!$D$35))","v":0},null,{"$f":"IF(B47=J$17,Captura!$L$29,0)","v":0},{"$f":"SUM(D47:F47,I47:N47)*Captura!$C$19","v":{"$error":"#DIV/0!"}},{"$error":"#DIV/0!"},null,null,8,19,0,null,{"$f":"+V46*Captura!$O$9/12","v":0},0,0,{"$f":"IF(U47=J$17,Captura!$L$33,0)","v":0},null,{"$f":"IF(U47+1>=$J$17,0,AC35*(1+Captura!$D$35))","v":0},{"$f":"IF(U47+1>=$J$17,0,AD35*(1+Captura!$D$35))","v":0},{"$f":"IF(U47+1>=$J$17,0,AE35*(1+Captura!$D$35))","v":0},null,{"$f":"+(W47+AB47+AC47+AD47+AE47+AF47)*Captura!$C$19","v":0},0,null,{"$error":"#DIV/0!"},0]
[null,20,"2027-11-04",{"$f":"IF(B48<J$17,Captura!$L$16,0)+Resumen!$J$29+Resumen!$J$30","v":{"$error":"#DIV/0!"}},null,null,null,0,null,null,{"$f":"IF(B48+1>=$J$17,0,K36*(1+Captura!$D$35))","v":0},{"$f":"IF(B48+1>=$J$17,0,L36*(1+Captura!$D$35))","v":0},{"$f":"IF(B48+1>=$J$17,0,M36*(1+Captura!$D$35))","v":0},null,{"$f":"IF(B48=J$17,Captura!$L$29,0)","v":0},{"$f":"SUM(D48:F48,I48:N48)*Captura!$C$19","v":{"$error":"#DIV/0!"}},{"$error":"#DIV/0!"},null,null,9,20,0,null,{"$f":"+V47*Captura!$O$9/12","v":0},0,0,{"$f":"IF(U48=J$17,Captura!$L$33,0)","v":0},null,{"$f":"IF(U48+1>=$J$17,0,AC36*(1+Captura!$D$35))","v":0},{"$f":"IF(U48+1>=$J$17,0,AD36*(1+Captura!$D$35))","v":0},{"$f":"IF(U48+1>=$J$17,0,AE36*(1+Captura!$D$35))","v":0},null,{"$f":"+(W48+AB48+AC48+AD48+AE48+AF48)*Captura!$C$19","v":0},0,null,{"$error":"#DIV/0!"},0]
[null,21,"2027-12-04",{"$f":"IF(B49<J$17,Captura!$L$16,0)+Resumen!$J$29+Resumen!$J$30","v":{"$error":"#DIV/0!"}},null,null,null,0,null,null,{"$f":"IF(B49+1>=$J$17,0,K37*(1+Captura!$D$35))","v":0},{"$f":"IF(B49+1>=$J$17,0,L37*(1+Captura!$D$35))","v":0},{"$f":"IF(B49+1>=$J$17,0,M37*(1+Captura!$D$35))","v":0},null,{"$f":"IF(B49=J$17,Captura!$L$29,0)","v":0},{"$f":"SUM(D49:F49,I49:N49)*Captura!$C$19","v":{"$error":"#DIV/0!"}},{"$error":"#DIV/0!"},null,null,10,21,0,null,{"$f":"+V48*Captura!$O$9/12","v":0},0,0,{"$f":"IF(U49=J$17,Captura!$L$33,0)","v":0},null,{"$f":"IF(U49+1>=$J$17,0,AC37*(1+Captura!$D$35))","v":0},{"$f":"IF(U49+1>=$J$17,0,AD37*(1+Captura!$D$35))","v":0},{"$f":"IF(U49+1>=$J$17,0,AE37*(1+Captura!$D$35))","v":0},null,{"$f":"+(W49+AB49+AC49+AD49+AE49+AF49)*Captura!$C$19","v":0},0,null,{"$error":"#DIV/0!"},0]
[null,22,"2028-01-04",{"$f":"IF(B50<J$17,Captura!$L$16,0)+Resumen!$J$29+Resumen!$J$30","v":{"$error":"#DIV/0!"}},null,null,null,0,null,null,{"$f":"IF(B50+1>=$J$17,0,K38*(1+Captura!$D$35))","v":0},{"$f":"IF(B50+1>=$J$17,0,L38*(1+Captura!$D$35))","v":0},{"$f":"IF(B50+1>=$J$17,0,M38*(1+Captura!$D$35))","v":0},null,{"$f":"IF(B50=J$17,Captura!$L$29,0)","v":0},{"$f":"SUM(D50:F50,I50:N50)*Captura!$C$19","v":{"$error":"#DIV/0!"}},{"$error":"#DIV/0!"},null,null,11,22,0,null,{"$f":"+V49*Captura!$O$9/12","v":0},0,0,{"$f":"IF(U50=J$17,Captura!$L$33,0)","v":0},null,{"$f":"IF(U50+1>=$J$17,0,AC38*(1+Captura!$D$35))","v":0},{"$f":"IF(U50+1>=$J$17,0,AD38*(1+Captura!$D$35))","v":0},{"$f":"IF(U50+1>=$J$17,0,AE38*(1+Captura!$D$35))","v":0},null,{"$f":"+(W50+AB50+AC50+AD50+AE50+AF50)*Captura!$C$19","v":0},0,null,{"$error":"#DIV/0!"},0]
[null,23,"2028-02-04",{"$f":"IF(B51<J$17,Captura!$L$16,0)+Resumen!$J$29+Resumen!$J$30","v":{"$error":"#DIV/0!"}},null,null,null,0,null,null,{"$f":"IF(B51+1>=$J$17,0,K39*(1+Captura!$D$35))","v":0},{"$f":"IF(B51+1>=$J$17,0,L39*(1+Captura!$D$35))","v":0},{"$f":"IF(B51+1>=$J$17,0,M39*(1+Captura!$D$35))","v":0},null,{"$f":"IF(B51=J$17,Captura!$L$29,0)","v":0},{"$f":"SUM(D51:F51,I51:N51)*Captura!$C$19","v":{"$error":"#DIV/0!"}},{"$error":"#DIV/0!"},null,null,12,23,0,null,{"$f":"+V50*Captura!$O$9/12","v":0},0,0,{"$f":"IF(U51=J$17,Captura!$L$33,0)","v":0},null,{"$f":"IF(U51+1>=$J$17,0,AC39*(1+Captura!$D$35))","v":0},{"$f":"IF(U51+1>=$J$17,0,AD39*(1+Captura!$D$35))","v":0},{"$f":"IF(U51+1>=$J$17,0,AE39*(1+Captura!$D$35))","v":0},null,{"$f":"+(W51+AB51+AC51+AD51+AE51+AF51)*Captura!$C$19","v":0},0,null,{"$error":"#DIV/0!"},0]
[null,24,"2028-03-04",{"$f":"IF(B52<J$17,Captura!$L$16,0)","v":0},null,null,null,0,null,null,{"$f":"IF(B52+1>=$J$17,0,K40*(1+Captura!$D$35))","v":0},{"$f":"IF(B52+1>=$J$17,0,L40*(1+Captura!$D$35))","v":0},{"$f":"IF(B52+1>=$J$17,0,M40*(1+Captura!$D$35))","v":0},null,{"$f":"IF(B52=J$17,Captura!$L$29,0)","v":0},{"$f":"SUM(D52:F52,I52:N52)*Captura!$C$19","v":0},0,null,null,1,24,0,null,{"$f":"+V51*Captura!$O$9/12","v":0},0,0,{"$f":"IF(U52=J$17,Captura!$L$33,0)","v":0},null,{"$f":"IF(U52+1>=$J$17,0,AC40*(1+Captura!$D$35))","v":0},{"$f":"IF(U52+1>=$J$17,0,AD40*(1+Captura!$D$35))","v":0},{"$f":"IF(U52+1>=$J$17,0,AE40*(1+Captura!$D$35))","v":0},null,{"$f":"+(W52+AB52+AC52+AD52+AE52+AF52)*Captura!$C$19","v":0},0,null,0,0]
[null,25,"2028-04-04",{"$f":"IF(B53<J$17,Captura!$L$16,0)","v":0},null,null,null,0,null,null,{"$f":"IF(B53+1>=$J$17,0,K41*(1+Captura!$D$35))","v":0},{"$f":"IF(B53+1>=$J$17,0,L41*(1+Captura!$D$35))","v":0},{"$f":"IF(B53+1>=$J$17,0,M41*(1+Captura!$D$35))","v":0},null,{"$f":"IF(B53=J$17,Captura!$L$29,0)","v":0},{"$f":"SUM(D53:F53,I53:N53)*Captura!$C$19","v":0},0,null,null,2,25,0,null,{"$f":"+V52*Captura!$O$9/12","v":0},0,0,{"$f":"IF(U53=J$17,Captura!$L$33,0)","v":0},null,{"$f":"IF(U53+1>=$J$17,0,AC41*(1+Captura!$D$35))","v":0},{"$f":"IF(U53+1>=$J$17,0,AD41*(1+Captura!$D$35))","v":0},{"$f":"IF(U53+1>=$J$17,0,AE41*(1+Captura!$D$35))","v":0},null,{"$f":"+(W53+AB53+AC53+AD53+AE53+AF53)*Captura!$C$19","v":0},0,null,0,0]
[null,26,"2028-05-04",{"$f":"IF(B54<J$17,Captura!$L$16,0)","v":0},null,null,null,0,null,null,{"$f":"IF(B54+1>=$J$17,0,K42*(1+Captura!$D$35))","v":0},{"$f":"IF(B54+1>=$J$17,0,L42*(1+Captura!$D$35))","v":0},{"$f":"IF(B54+1>=$J$17,0,M42*(1+Captura!$D$35))","v":0},null,{"$f":"IF(B54=J$17,Captura!$L$29,0)","v":0},{"$f":"SUM(D54:F54,I54:N54)*Captura!$C$19","v":0},0,null,null,3,26,0,null,{"$f":"+V53*Captura!$O$9/12","v":0},0,0,{"$f":"IF(U54=J$17,Captura!$L$33,0)","v":0},null,{"$f":"IF(U54+1>=$J$17,0,AC42*(1+Captura!$D$35))","v":0},{"$f":"IF(U54+1>=$J$17,0,AD42*(1+Captura!$D$35))","v":0},{"$f":"IF(U54+1>=$J$17,0,AE42*(1+Captura!$D$35))","v":0},null,{"$f":"+(W54+AB54+AC54+AD54+AE54+AF54)*Captura!$C$19","v":0},0,null,0,0]
[null,27,"2028-06-04",{"$f":"IF(B55<J$17,Captura!$L$16,0)","v":0},null,null,null,0,null,null,{"$f":"IF(B55+1>=$J$17,0,K43*(1+Captura!$D$35))","v":0},{"$f":"IF(B55+1>=$J$17,0,L43*(1+Captura!$D$35))","v":0},{"$f":"IF(B55+1>=$J$17,0,M43*(1+Captura!$D$35))","v":0},null,{"$f":"IF(B55=J$17,Captura!$L$29,0)","v":0},{"$f":"SUM(D55:F55,I55:N55)*Captura!$C$19","v":0},0,null,null,4,27,0,null,{"$f":"+V54*Captura!$O$9/12","v":0},0,0,{"$f":"IF(U55=J$17,Captura!$L$33,0)","v":0},null,{"$f":"IF(U55+1>=$J$17,0,AC43*(1+Captura!$D$35))","v":0},{"$f":"IF(U55+1>=$J$17,0,AD43*(1+Captura!$D$35))","v":0},{"$f":"IF(U55+1>=$J$17,0,AE43*(1+Captura!$D$35))","v":0},null,{"$f":"+(W55+AB55+AC55+AD55+AE55+AF55)*Captura!$C$19","v":0},0,null,0,0]
[null,28,"2028-07-04",{"$f":"IF(B56<J$17,Captura!$L$16,0)","v":0},null,null,null,0,null,null,{"$f":"IF(B56+1>=$J$17,0,K44*(1+Captura!$D$35))","v":0},{"$f":"IF(B56+1>=$J$17,0,L44*(1+Captura!$D$35))","v":0},{"$f":"IF(B56+1>=$J$17,0,M44*(1+Captura!$D$35))","v":0},null,{"$f":"IF(B56=J$17,Captura!$L$29,0)","v":0},{"$f":"SUM(D56:F56,I56:N56)*Captura!$C$19","v":0},0,null,null,5,28,0,null,{"$f":"+V55*Captura!$O$9/12","v":0},0,0,{"$f":"IF(U56=J$17,Captura!$L$33,0)","v":0},null,{"$f":"IF(U56+1>=$J$17,0,AC44*(1+Captura!$D$35))","v":0},{"$f":"IF(U56+1>=$J$17,0,AD44*(1+Captura!$D$35))","v":0},{"$f":"IF(U56+1>=$J$17,0,AE44*(1+Captura!$D$35))","v":0},null,{"$f":"+(W56+AB56+AC56+AD56+AE56+AF56)*Captura!$C$19","v":0},0,null,0,0]
[null,29,"2028-08-04",{"$f":"IF(B57<J$17,Captura!$L$16,0)","v":0},null,null,null,0,null,null,{"$f":"IF(B57+1>=$J$17,0,K45*(1+Captura!$D$35))","v":0},{"$f":"IF(B57+1>=$J$17,0,L45*(1+Captura!$D$35))","v":0},{"$f":"IF(B57+1>=$J$17,0,M45*(1+Captura!$D$35))","v":0},null,{"$f":"IF(B57=J$17,Captura!$L$29,0)","v":0},{"$f":"SUM(D57:F57,I57:N57)*Captura!$C$19","v":0},0,null,null,6,29,0,null,{"$f":"+V56*Captura!$O$9/12","v":0},0,0,{"$f":"IF(U57=J$17,Captura!$L$33,0)","v":0},null,{"$f":"IF(U57+1>=$J$17,0,AC45*(1+Captura!$D$35))","v":0},{"$f":"IF(U57+1>=$J$17,0,AD45*(1+Captura!$D$35))","v":0},{"$f":"IF(U57+1>=$J$17,0,AE45*(1+Captura!$D$35))","v":0},null,{"$f":"+(W57+AB57+AC57+AD57+AE57+AF57)*Captura!$C$19","v":0},0,null,0,0]
[null,30,"2028-09-04",{"$f":"IF(B58<J$17,Captura!$L$16,0)","v":0},null,null,null,0,null,null,{"$f":"IF(B58+1>=$J$17,0,K46*(1+Captura!$D$35))","v":0},{"$f":"IF(B58+1>=$J$17,0,L46*(1+Captura!$D$35))","v":0},{"$f":"IF(B58+1>=$J$17,0,M46*(1+Captura!$D$35))","v":0},null,{"$f":"IF(B58=J$17,Captura!$L$29,0)","v":0},{"$f":"SUM(D58:F58,I58:N58)*Captura!$C$19","v":0},0,null,null,7,30,0,null,{"$f":"+V57*Captura!$O$9/12","v":0},0,0,{"$f":"IF(U58=J$17,Captura!$L$33,0)","v":0},null,{"$f":"IF(U58+1>=$J$17,0,AC46*(1+Captura!$D$35))","v":0},{"$f":"IF(U58+1>=$J$17,0,AD46*(1+Captura!$D$35))","v":0},{"$f":"IF(U58+1>=$J$17,0,AE46*(1+Captura!$D$35))","v":0},null,{"$f":"+(W58+AB58+AC58+AD58+AE58+AF58)*Captura!$C$19","v":0},0,null,0,0]
[null,31,"2028-10-04",{"$f":"IF(B59<J$17,Captura!$L$16,0)","v":0},null,null,null,0,null,null,{"$f":"IF(B59+1>=$J$17,0,K47*(1+Captura!$D$35))","v":0},{"$f":"IF(B59+1>=$J$17,0,L47*(1+Captura!$D$35))","v":0},{"$f":"IF(B59+1>=$J$17,0,M47*(1+Captura!$D$35))","v":0},null,{"$f":"IF(B59=J$17,Captura!$L$29,0)","v":0},{"$f":"SUM(D59:F59,I59:N59)*Captura!$C$19","v":0},0,null,null,8,31,0,null,{"$f":"+V58*Captura!$O$9/12","v":0},0,0,{"$f":"IF(U59=J$17,Captura!$L$33,0)","v":0},null,{"$f":"IF(U59+1>=$J$17,0,AC47*(1+Captura!$D$35))","v":0},{"$f":"IF(U59+1>=$J$17,0,AD47*(1+Captura!$D$35))","v":0},{"$f":"IF(U59+1>=$J$17,0,AE47*(1+Captura!$D$35))","v":0},null,{"$f":"+(W59+AB59+AC59+AD59+AE59+AF59)*Captura!$C$19","v":0},0,null,0,0]
[null,32,"2028-11-04",{"$f":"IF(B60<J$17,Captura!$L$16,0)","v":0},null,null,null,0,null,null,{"$f":"IF(B60+1>=$J$17,0,K48*(1+Captura!$D$35))","v":0},{"$f":"IF(B60+1>=$J$17,0,L48*(1+Captura!$D$35))","v":0},{"$f":"IF(B60+1>=$J$17,0,M48*(1+Captura!$D$35))","v":0},null,{"$f":"IF(B60=J$17,Captura!$L$29,0)","v":0},{"$f":"SUM(D60:F60,I60:N60)*Captura!$C$19","v":0},0,null,null,9,32,0,null,{"$f":"+V59*Captura!$O$9/12","v":0},0,0,{"$f":"IF(U60=J$17,Captura!$L$33,0)","v":0},null,{"$f":"IF(U60+1>=$J$17,0,AC48*(1+Captura!$D$35))","v":0},{"$f":"IF(U60+1>=$J$17,0,AD48*(1+Captura!$D$35))","v":0},{"$f":"IF(U60+1>=$J$17,0,AE48*(1+Captura!$D$35))","v":0},null,{"$f":"+(W60+AB60+AC60+AD60+AE60+AF60)*Captura!$C$19","v":0},0,null,0,0]
[null,33,"2028-12-04",{"$f":"IF(B61<J$17,Captura!$L$16,0)","v":0},null,null,null,0,null,null,{"$f":"IF(B61+1>=$J$17,0,K49*(1+Captura!$D$35))","v":0},{"$f":"IF(B61+1>=$J$17,0,L49*(1+Captura!$D$35))","v":0},{"$f":"IF(B61+1>=$J$17,0,M49*(1+Captura!$D$35))","v":0},null,{"$f":"IF(B61=J$17,Captura!$L$29,0)","v":0},{"$f":"SUM(D61:F61,I61:N61)*Captura!$C$19","v":0},0,null,null,10,33,0,null,{"$f":"+V60*Captura!$O$9/12","v":0},0,0,{"$f":"IF(U61=J$17,Captura!$L$33,0)","v":0},null,{"$f":"IF(U61+1>=$J$17,0,AC49*(1+Captura!$D$35))","v":0},{"$f":"IF(U61+1>=$J$17,0,AD49*(1+Captura!$D$35))","v":0},{"$f":"IF(U61+1>=$J$17,0,AE49*(1+Captura!$D$35))","v":0},null,{"$f":"+(W61+AB61+AC61+AD61+AE61+AF61)*Captura!$C$19","v":0},0,null,0,0]
[null,34,"2029-01-04",{"$f":"IF(B62<J$17,Captura!$L$16,0)","v":0},null,null,null,0,null,null,{"$f":"IF(B62+1>=$J$17,0,K50*(1+Captura!$D$35))","v":0},{"$f":"IF(B62+1>=$J$17,0,L50*(1+Captura!$D$35))","v":0},{"$f":"IF(B62+1>=$J$17,0,M50*(1+Captura!$D$35))","v":0},null,{"$f":"IF(B62=J$17,Captura!$L$29,0)","v":0},{"$f":"SUM(D62:F62,I62:N62)*Captura!$C$19","v":0},0,null,null,11,34,0,null,{"$f":"+V61*Captura!$O$9/12","v":0},0,0,{"$f":"IF(U62=J$17,Captura!$L$33,0)","v":0},null,{"$f":"IF(U62+1>=$J$17,0,AC50*(1+Captura!$D$35))","v":0},{"$f":"IF(U62+1>=$J$17,0,AD50*(1+Captura!$D$35))","v":0},{"$f":"IF(U62+1>=$J$17,0,AE50*(1+Captura!$D$35))","v":0},null,{"$f":"+(W62+AB62+AC62+AD62+AE62+AF62)*Captura!$C$19","v":0},0,null,0,0]
[null,35,"2029-02-04",{"$f":"IF(B63<J$17,Captura!$L$16,0)","v":0},null,null,null,0,null,null,{"$f":"IF(B63+1>=$J$17,0,K51*(1+Captura!$D$35))","v":0},{"$f":"IF(B63+1>=$J$17,0,L51*(1+Captura!$D$35))","v":0},{"$f":"IF(B63+1>=$J$17,0,M51*(1+Captura!$D$35))","v":0},null,{"$f":"IF(B63=J$17,Captura!$L$29,0)","v":0},{"$f":"SUM(D63:F63,I63:N63)*Captura!$C$19","v":0},0,null,null,12,35,0,null,{"$f":"+V62*Captura!$O$9/12","v":0},0,0,{"$f":"IF(U63=J$17,Captura!$L$33,0)","v":0},null,{"$f":"IF(U63+1>=$J$17,0,AC51*(1+Captura!$D$35))","v":0},{"$f":"IF(U63+1>=$J$17,0,AD51*(1+Captura!$D$35))","v":0},{"$f":"IF(U63+1>=$J$17,0,AE51*(1+Captura!$D$35))","v":0},null,{"$f":"+(W63+AB63+AC63+AD63+AE63+AF63)*Captura!$C$19","v":0},0,null,0,0]
[null,36,"2029-03-04",{"$f":"IF(B64<J$17,Captura!$L$16,0)","v":0},null,null,null,0,null,null,{"$f":"IF(B64+1>=$J$17,0,K52*(1+Captura!$D$35))","v":0},{"$f":"IF(B64+1>=$J$17,0,L52*(1+Captura!$D$35))","v":0},{"$f":"IF(B64+1>=$J$17,0,M52*(1+Captura!$D$35))","v":0},null,{"$f":"IF(B64=J$17,Captura!$L$29,0)","v":0},{"$f":"SUM(D64:F64,I64:N64)*Captura!$C$19","v":0},0,null,null,1,36,0,null,{"$f":"+V63*Captura!$O$9/12","v":0},0,0,{"$f":"IF(U64=J$17,Captura!$L$33,0)","v":0},null,{"$f":"IF(U64+1>=$J$17,0,AC52*(1+Captura!$D$35))","v":0},{"$f":"IF(U64+1>=$J$17,0,AD52*(1+Captura!$D$35))","v":0},{"$f":"IF(U64+1>=$J$17,0,AE52*(1+Captura!$D$35))","v":0},null,{"$f":"+(W64+AB64+AC64+AD64+AE64+AF64)*Captura!$C$19","v":0},0,null,0,0]
[null,37,"2029-04-04",{"$f":"IF(B65<J$17,Captura!$L$16,0)","v":0},null,null,null,0,null,null,{"$f":"IF(B65+1>=$J$17,0,K53*(1+Captura!$D$35))","v":0},{"$f":"IF(B65+1>=$J$17,0,L53*(1+Captura!$D$35))","v":0},{"$f":"IF(B65+1>=$J$17,0,M53*(1+Captura!$D$35))","v":0},null,{"$f":"IF(B65=J$17,Captura!$L$29,0)","v":0},{"$f":"SUM(D65:F65,I65:N65)*Captura!$C$19","v":0},0,null,null,2,37,0,null,{"$f":"+V64*Captura!$O$9/12","v":0},0,0,{"$f":"IF(U65=J$17,Captura!$L$33,0)","v":0},null,{"$f":"IF(U65+1>=$J$17,0,AC53*(1+Captura!$D$35))","v":0},{"$f":"IF(U65+1>=$J$17,0,AD53*(1+Captura!$D$35))","v":0},{"$f":"IF(U65+1>=$J$17,0,AE53*(1+Captura!$D$35))","v":0},null,{"$f":"+(W65+AB65+AC65+AD65+AE65+AF65)*Captura!$C$19","v":0},0,null,0,0]
[null,38,"2029-05-04",{"$f":"IF(B66<J$17,Captura!$L$16,0)","v":0},null,null,null,0,null,null,{"$f":"IF(B66+1>=$J$17,0,K54*(1+Captura!$D$35))","v":0},{"$f":"IF(B66+1>=$J$17,0,L54*(1+Captura!$D$35))","v":0},{"$f":"IF(B66+1>=$J$17,0,M54*(1+Captura!$D$35))","v":0},null,{"$f":"IF(B66=J$17,Captura!$L$29,0)","v":0},{"$f":"SUM(D66:F66,I66:N66)*Captura!$C$19","v":0},0,null,null,3,38,0,null,{"$f":"+V65*Captura!$O$9/12","v":0},0,0,{"$f":"IF(U66=J$17,Captura!$L$33,0)","v":0},null,{"$f":"IF(U66+1>=$J$17,0,AC54*(1+Captura!$D$35))","v":0},{"$f":"IF(U66+1>=$J$17,0,AD54*(1+Captura!$D$35))","v":0},{"$f":"IF(U66+1>=$J$17,0,AE54*(1+Captura!$D$35))","v":0},null,{"$f":"+(W66+AB66+AC66+AD66+AE66+AF66)*Captura!$C$19","v":0},0,null,0,0]
[null,39,"2029-06-04",{"$f":"IF(B67<J$17,Captura!$L$16,0)","v":0},null,null,null,0,null,null,{"$f":"IF(B67+1>=$J$17,0,K55*(1+Captura!$D$35))","v":0},{"$f":"IF(B67+1>=$J$17,0,L55*(1+Captura!$D$35))","v":0},{"$f":"IF(B67+1>=$J$17,0,M55*(1+Captura!$D$35))","v":0},null,{"$f":"IF(B67=J$17,Captura!$L$29,0)","v":0},{"$f":"SUM(D67:F67,I67:N67)*Captura!$C$19","v":0},0,null,null,4,39,0,null,{"$f":"+V66*Captura!$O$9/12","v":0},0,0,{"$f":"IF(U67=J$17,Captura!$L$33,0)","v":0},null,{"$f":"IF(U67+1>=$J$17,0,AC55*(1+Captura!$D$35))","v":0},{"$f":"IF(U67+1>=$J$17,0,AD55*(1+Captura!$D$35))","v":0},{"$f":"IF(U67+1>=$J$17,0,AE55*(1+Captura!$D$35))","v":0},null,{"$f":"+(W67+AB67+AC67+AD67+AE67+AF67)*Captura!$C$19","v":0},0,null,0,0]
[null,40,"2029-07-04",{"$f":"IF(B68<J$17,Captura!$L$16,0)","v":0},null,null,null,0,null,null,{"$f":"IF(B68+1>=$J$17,0,K56*(1+Captura!$D$35))","v":0},{"$f":"IF(B68+1>=$J$17,0,L56*(1+Captura!$D$35))","v":0},{"$f":"IF(B68+1>=$J$17,0,M56*(1+Captura!$D$35))","v":0},null,{"$f":"IF(B68=J$17,Captura!$L$29,0)","v":0},{"$f":"SUM(D68:F68,I68:N68)*Captura!$C$19","v":0},0,null,null,5,40,0,null,{"$f":"+V67*Captura!$O$9/12","v":0},0,0,{"$f":"IF(U68=J$17,Captura!$L$33,0)","v":0},null,{"$f":"IF(U68+1>=$J$17,0,AC56*(1+Captura!$D$35))","v":0},{"$f":"IF(U68+1>=$J$17,0,AD56*(1+Captura!$D$35))","v":0},{"$f":"IF(U68+1>=$J$17,0,AE56*(1+Captura!$D$35))","v":0},null,{"$f":"+(W68+AB68+AC68+AD68+AE68+AF68)*Captura!$C$19","v":0},0,null,0,0]
[null,41,"2029-08-04",{"$f":"IF(B69<J$17,Captura!$L$16,0)","v":0},null,null,null,0,null,null,{"$f":"IF(B69+1>=$J$17,0,K57*(1+Captura!$D$35))","v":0},{"$f":"IF(B69+1>=$J$17,0,L57*(1+Captura!$D$35))","v":0},{"$f":"IF(B69+1>=$J$17,0,M57*(1+Captura!$D$35))","v":0},null,{"$f":"IF(B69=J$17,Captura!$L$29,0)","v":0},{"$f":"SUM(D69:F69,I69:N69)*Captura!$C$19","v":0},0,null,null,6,41,0,null,{"$f":"+V68*Captura!$O$9/12","v":0},0,0,{"$f":"IF(U69=J$17,Captura!$L$33,0)","v":0},null,{"$f":"IF(U69+1>=$J$17,0,AC57*(1+Captura!$D$35))","v":0},{"$f":"IF(U69+1>=$J$17,0,AD57*(1+Captura!$D$35))","v":0},{"$f":"IF(U69+1>=$J$17,0,AE57*(1+Captura!$D$35))","v":0},null,{"$f":"+(W69+AB69+AC69+AD69+AE69+AF69)*Captura!$C$19","v":0},0,null,0,0]
[null,42,"2029-09-04",{"$f":"IF(B70<J$17,Captura!$L$16,0)","v":0},null,null,null,0,null,null,{"$f":"IF(B70+1>=$J$17,0,K58*(1+Captura!$D$35))","v":0},{"$f":"IF(B70+1>=$J$17,0,L58*(1+Captura!$D$35))","v":0},{"$f":"IF(B70+1>=$J$17,0,M58*(1+Captura!$D$35))","v":0},null,{"$f":"IF(B70=J$17,Captura!$L$29,0)","v":0},{"$f":"SUM(D70:F70,I70:N70)*Captura!$C$19","v":0},0,null,null,7,42,0,null,{"$f":"+V69*Captura!$O$9/12","v":0},0,0,{"$f":"IF(U70=J$17,Captura!$L$33,0)","v":0},null,{"$f":"IF(U70+1>=$J$17,0,AC58*(1+Captura!$D$35))","v":0},{"$f":"IF(U70+1>=$J$17,0,AD58*(1+Captura!$D$35))","v":0},{"$f":"IF(U70+1>=$J$17,0,AE58*(1+Captura!$D$35))","v":0},null,{"$f":"+(W70+AB70+AC70+AD70+AE70+AF70)*Captura!$C$19","v":0},0,null,0,0]
[null,43,"2029-10-04",{"$f":"IF(B71<J$17,Captura!$L$16,0)","v":0},null,null,null,0,null,null,{"$f":"IF(B71+1>=$J$17,0,K59*(1+Captura!$D$35))","v":0},{"$f":"IF(B71+1>=$J$17,0,L59*(1+Captura!$D$35))","v":0},{"$f":"IF(B71+1>=$J$17,0,M59*(1+Captura!$D$35))","v":0},null,{"$f":"IF(B71=J$17,Captura!$L$29,0)","v":0},{"$f":"SUM(D71:F71,I71:N71)*Captura!$C$19","v":0},0,null,null,8,43,0,null,{"$f":"+V70*Captura!$O$9/12","v":0},0,0,{"$f":"IF(U71=J$17,Captura!$L$33,0)","v":0},null,{"$f":"IF(U71+1>=$J$17,0,AC59*(1+Captura!$D$35))","v":0},{"$f":"IF(U71+1>=$J$17,0,AD59*(1+Captura!$D$35))","v":0},{"$f":"IF(U71+1>=$J$17,0,AE59*(1+Captura!$D$35))","v":0},null,{"$f":"+(W71+AB71+AC71+AD71+AE71+AF71)*Captura!$C$19","v":0},0,null,0,0]
[null,44,"2029-11-04",{"$f":"IF(B72<J$17,Captura!$L$16,0)","v":0},null,null,null,0,null,null,{"$f":"IF(B72+1>=$J$17,0,K60*(1+Captura!$D$35))","v":0},{"$f":"IF(B72+1>=$J$17,0,L60*(1+Captura!$D$35))","v":0},{"$f":"IF(B72+1>=$J$17,0,M60*(1+Captura!$D$35))","v":0},null,{"$f":"IF(B72=J$17,Captura!$L$29,0)","v":0},{"$f":"SUM(D72:F72,I72:N72)*Captura!$C$19","v":0},0,null,null,9,44,0,null,{"$f":"+V71*Captura!$O$9/12","v":0},0,0,{"$f":"IF(U72=J$17,Captura!$L$33,0)","v":0},null,{"$f":"IF(U72+1>=$J$17,0,AC60*(1+Captura!$D$35))","v":0},{"$f":"IF(U72+1>=$J$17,0,AD60*(1+Captura!$D$35))","v":0},{"$f":"IF(U72+1>=$J$17,0,AE60*(1+Captura!$D$35))","v":0},null,{"$f":"+(W72+AB72+AC72+AD72+AE72+AF72)*Captura!$C$19","v":0},0,null,0,0]
[null,45,"2029-12-04",{"$f":"IF(B73<J$17,Captura!$L$16,0)","v":0},null,null,null,0,null,null,{"$f":"IF(B73+1>=$J$17,0,K61*(1+Captura!$D$35))","v":0},{"$f":"IF(B73+1>=$J$17,0,L61*(1+Captura!$D$35))","v":0},{"$f":"IF(B73+1>=$J$17,0,M61*(1+Captura!$D$35))","v":0},null,{"$f":"IF(B73=J$17,Captura!$L$29,0)","v":0},{"$f":"SUM(D73:F73,I73:N73)*Captura!$C$19","v":0},0,null,null,10,45,0,null,{"$f":"+V72*Captura!$O$9/12","v":0},0,0,{"$f":"IF(U73=J$17,Captura!$L$33,0)","v":0},null,{"$f":"IF(U73+1>=$J$17,0,AC61*(1+Captura!$D$35))","v":0},{"$f":"IF(U73+1>=$J$17,0,AD61*(1+Captura!$D$35))","v":0},{"$f":"IF(U73+1>=$J$17,0,AE61*(1+Captura!$D$35))","v":0},null,{"$f":"+(W73+AB73+AC73+AD73+AE73+AF73)*Captura!$C$19","v":0},0,null,0,0]
[null,46,"2030-01-04",{"$f":"IF(B74<J$17,Captura!$L$16,0)","v":0},null,null,null,0,null,null,{"$f":"IF(B74+1>=$J$17,0,K62*(1+Captura!$D$35))","v":0},{"$f":"IF(B74+1>=$J$17,0,L62*(1+Captura!$D$35))","v":0},{"$f":"IF(B74+1>=$J$17,0,M62*(1+Captura!$D$35))","v":0},null,{"$f":"IF(B74=J$17,Captura!$L$29,0)","v":0},{"$f":"SUM(D74:F74,I74:N74)*Captura!$C$19","v":0},0,null,null,11,46,0,null,{"$f":"+V73*Captura!$O$9/12","v":0},0,0,{"$f":"IF(U74=J$17,Captura!$L$33,0)","v":0},null,{"$f":"IF(U74+1>=$J$17,0,AC62*(1+Captura!$D$35))","v":0},{"$f":"IF(U74+1>=$J$17,0,AD62*(1+Captura!$D$35))","v":0},{"$f":"IF(U74+1>=$J$17,0,AE62*(1+Captura!$D$35))","v":0},null,{"$f":"+(W74+AB74+AC74+AD74+AE74+AF74)*Captura!$C$19","v":0},0,null,0,0]
[null,47,"2030-02-04",{"$f":"IF(B75<J$17,Captura!$L$16,0)","v":0},null,null,null,0,null,null,{"$f":"IF(B75+1>=$J$17,0,K63*(1+Captura!$D$35))","v":0},{"$f":"IF(B75+1>=$J$17,0,L63*(1+Captura!$D$35))","v":0},{"$f":"IF(B75+1>=$J$17,0,M63*(1+Captura!$D$35))","v":0},null,{"$f":"IF(B75=J$17,Captura!$L$29,0)","v":0},{"$f":"SUM(D75:F75,I75:N75)*Captura!$C$19","v":0},0,null,null,12,47,0,null,{"$f":"+V74*Captura!$O$9/12","v":0},0,0,{"$f":"IF(U75=J$17,Captura!$L$33,0)","v":0},null,{"$f":"IF(U75+1>=$J$17,0,AC63*(1+Captura!$D$35))","v":0},{"$f":"IF(U75+1>=$J$17,0,AD63*(1+Captura!$D$35))","v":0},{"$f":"IF(U75+1>=$J$17,0,AE63*(1+Captura!$D$35))","v":0},null,{"$f":"+(W75+AB75+AC75+AD75+AE75+AF75)*Captura!$C$19","v":0},0,null,0,0]
[null,48,"2030-03-04",{"$f":"IF(B76<J$17,Captura!$L$16,0)","v":0},null,null,null,0,null,null,{"$f":"IF(B76+1>=$J$17,0,K64*(1+Captura!$D$35))","v":0},{"$f":"IF(B76+1>=$J$17,0,L64*(1+Captura!$D$35))","v":0},{"$f":"IF(B76+1>=$J$17,0,M64*(1+Captura!$D$35))","v":0},null,{"$f":"IF(B76=J$17,Captura!$L$29,0)","v":0},{"$f":"SUM(D76:F76,I76:N76)*Captura!$C$19","v":0},0,null,null,1,48,0,null,{"$f":"+V75*Captura!$O$9/12","v":0},0,0,{"$f":"IF(U76=J$17,Captura!$L$33,0)","v":0},null,{"$f":"IF(U76+1>=$J$17,0,AC64*(1+Captura!$D$35))","v":0},{"$f":"IF(U76+1>=$J$17,0,AD64*(1+Captura!$D$35))","v":0},{"$f":"IF(U76+1>=$J$17,0,AE64*(1+Captura!$D$35))","v":0},null,{"$f":"+(W76+AB76+AC76+AD76+AE76+AF76)*Captura!$C$19","v":0},0,null,0,0]
[null,49,"2030-04-04",{"$f":"IF(B77<J$17,Captura!$L$16,0)","v":0},null,null,null,0,null,null,{"$f":"IF(B77+1>=$J$17,0,K65*(1+Captura!$D$35))","v":0},{"$f":"IF(B77+1>=$J$17,0,L65*(1+Captura!$D$35))","v":0},{"$f":"IF(B77+1>=$J$17,0,M65*(1+Captura!$D$35))","v":0},null,{"$f":"IF(B77=J$17,Captura!$L$29,0)","v":0},{"$f":"SUM(D77:F77,I77:N77)*Captura!$C$19","v":0},0,null,null,2,49,0,null,{"$f":"+V76*Captura!$O$9/12","v":0},0,0,{"$f":"IF(U77=J$17,Captura!$L$33,0)","v":0},null,{"$f":"IF(U77+1>=$J$17,0,AC65*(1+Captura!$D$35))","v":0},{"$f":"IF(U77+1>=$J$17,0,AD65*(1+Captura!$D$35))","v":0},{"$f":"IF(U77+1>=$J$17,0,AE65*(1+Captura!$D$35))","v":0},null,{"$f":"+(W77+AB77+AC77+AD77+AE77+AF77)*Captura!$C$19","v":0},0,null,0,0]
[null,50,"2030-05-04",{"$f":"IF(B78<J$17,Captura!$L$16,0)","v":0},null,null,null,0,null,null,{"$f":"IF(B78+1>=$J$17,0,K66*(1+Captura!$D$35))","v":0},{"$f":"IF(B78+1>=$J$17,0,L66*(1+Captura!$D$35))","v":0},{"$f":"IF(B78+1>=$J$17,0,M66*(1+Captura!$D$35))","v":0},null,{"$f":"IF(B78=J$17,Captura!$L$29,0)","v":0},{"$f":"SUM(D78:F78,I78:N78)*Captura!$C$19","v":0},0,null,null,3,50,0,null,{"$f":"+V77*Captura!$O$9/12","v":0},0,0,{"$f":"IF(U78=J$17,Captura!$L$33,0)","v":0},null,{"$f":"IF(U78+1>=$J$17,0,AC66*(1+Captura!$D$35))","v":0},{"$f":"IF(U78+1>=$J$17,0,AD66*(1+Captura!$D$35))","v":0},{"$f":"IF(U78+1>=$J$17,0,AE66*(1+Captura!$D$35))","v":0},null,{"$f":"+(W78+AB78+AC78+AD78+AE78+AF78)*Captura!$C$19","v":0},0,null,0,0]
[null,51,"2030-06-04",{"$f":"IF(B79<J$17,Captura!$L$16,0)","v":0},null,null,null,0,null,null,{"$f":"IF(B79+1>=$J$17,0,K67*(1+Captura!$D$35))","v":0},{"$f":"IF(B79+1>=$J$17,0,L67*(1+Captura!$D$35))","v":0},{"$f":"IF(B79+1>=$J$17,0,M67*(1+Captura!$D$35))","v":0},null,{"$f":"IF(B79=J$17,Captura!$L$29,0)","v":0},{"$f":"SUM(D79:F79,I79:N79)*Captura!$C$19","v":0},0,null,null,4,51,0,null,{"$f":"+V78*Captura!$O$9/12","v":0},0,0,{"$f":"IF(U79=J$17,Captura!$L$33,0)","v":0},null,{"$f":"IF(U79+1>=$J$17,0,AC67*(1+Captura!$D$35))","v":0},{"$f":"IF(U79+1>=$J$17,0,AD67*(1+Captura!$D$35))","v":0},{"$f":"IF(U79+1>=$J$17,0,AE67*(1+Captura!$D$35))","v":0},null,{"$f":"+(W79+AB79+AC79+AD79+AE79+AF79)*Captura!$C$19","v":0},0,null,0,0]
[null,52,"2030-07-04",{"$f":"IF(B80<J$17,Captura!$L$16,0)","v":0},null,null,null,0,null,null,{"$f":"IF(B80+1>=$J$17,0,K68*(1+Captura!$D$35))","v":0},{"$f":"IF(B80+1>=$J$17,0,L68*(1+Captura!$D$35))","v":0},{"$f":"IF(B80+1>=$J$17,0,M68*(1+Captura!$D$35))","v":0},null,{"$f":"IF(B80=J$17,Captura!$L$29,0)","v":0},{"$f":"SUM(D80:F80,I80:N80)*Captura!$C$19","v":0},0,null,null,5,52,0,null,{"$f":"+V79*Captura!$O$9/12","v":0},0,0,{"$f":"IF(U80=J$17,Captura!$L$33,0)","v":0},null,{"$f":"IF(U80+1>=$J$17,0,AC68*(1+Captura!$D$35))","v":0},{"$f":"IF(U80+1>=$J$17,0,AD68*(1+Captura!$D$35))","v":0},{"$f":"IF(U80+1>=$J$17,0,AE68*(1+Captura!$D$35))","v":0},null,{"$f":"+(W80+AB80+AC80+AD80+AE80+AF80)*Captura!$C$19","v":0},0,null,0,0]
[null,53,"2030-08-04",{"$f":"IF(B81<J$17,Captura!$L$16,0)","v":0},null,null,null,0,null,null,{"$f":"IF(B81+1>=$J$17,0,K69*(1+Captura!$D$35))","v":0},{"$f":"IF(B81+1>=$J$17,0,L69*(1+Captura!$D$35))","v":0},{"$f":"IF(B81+1>=$J$17,0,M69*(1+Captura!$D$35))","v":0},null,{"$f":"IF(B81=J$17,Captura!$L$29,0)","v":0},{"$f":"SUM(D81:F81,I81:N81)*Captura!$C$19","v":0},0,null,null,6,53,0,null,{"$f":"+V80*Captura!$O$9/12","v":0},0,0,{"$f":"IF(U81=J$17,Captura!$L$33,0)","v":0},null,{"$f":"IF(U81+1>=$J$17,0,AC69*(1+Captura!$D$35))","v":0},{"$f":"IF(U81+1>=$J$17,0,AD69*(1+Captura!$D$35))","v":0},{"$f":"IF(U81+1>=$J$17,0,AE69*(1+Captura!$D$35))","v":0},null,{"$f":"+(W81+AB81+AC81+AD81+AE81+AF81)*Captura!$C$19","v":0},0,null,0,0]
[null,54,"2030-09-04",{"$f":"IF(B82<J$17,Captura!$L$16,0)","v":0},null,null,null,0,null,null,{"$f":"IF(B82+1>=$J$17,0,K70*(1+Captura!$D$35))","v":0},{"$f":"IF(B82+1>=$J$17,0,L70*(1+Captura!$D$35))","v":0},{"$f":"IF(B82+1>=$J$17,0,M70*(1+Captura!$D$35))","v":0},null,{"$f":"IF(B82=J$17,Captura!$L$29,0)","v":0},{"$f":"SUM(D82:F82,I82:N82)*Captura!$C$19","v":0},0,null,null,7,54,0,null,{"$f":"+V81*Captura!$O$9/12","v":0},0,0,{"$f":"IF(U82=J$17,Captura!$L$33,0)","v":0},null,{"$f":"IF(U82+1>=$J$17,0,AC70*(1+Captura!$D$35))","v":0},{"$f":"IF(U82+1>=$J$17,0,AD70*(1+Captura!$D$35))","v":0},{"$f":"IF(U82+1>=$J$17,0,AE70*(1+Captura!$D$35))","v":0},null,{"$f":"+(W82+AB82+AC82+AD82+AE82+AF82)*Captura!$C$19","v":0},0,null,0,0]
[null,55,"2030-10-04",{"$f":"IF(B83<J$17,Captura!$L$16,0)","v":0},null,null,null,0,null,null,{"$f":"IF(B83+1>=$J$17,0,K71*(1+Captura!$D$35))","v":0},{"$f":"IF(B83+1>=$J$17,0,L71*(1+Captura!$D$35))","v":0},{"$f":"IF(B83+1>=$J$17,0,M71*(1+Captura!$D$35))","v":0},null,{"$f":"IF(B83=J$17,Captura!$L$29,0)","v":0},{"$f":"SUM(D83:F83,I83:N83)*Captura!$C$19","v":0},0,null,null,8,55,0,null,{"$f":"+V82*Captura!$O$9/12","v":0},0,0,{"$f":"IF(U83=J$17,Captura!$L$33,0)","v":0},null,{"$f":"IF(U83+1>=$J$17,0,AC71*(1+Captura!$D$35))","v":0},{"$f":"IF(U83+1>=$J$17,0,AD71*(1+Captura!$D$35))","v":0},{"$f":"IF(U83+1>=$J$17,0,AE71*(1+Captura!$D$35))","v":0},null,{"$f":"+(W83+AB83+AC83+AD83+AE83+AF83)*Captura!$C$19","v":0},0,null,0,0]
[null,56,"2030-11-04",{"$f":"IF(B84<J$17,Captura!$L$16,0)","v":0},null,null,null,0,null,null,{"$f":"IF(B84+1>=$J$17,0,K72*(1+Captura!$D$35))","v":0},{"$f":"IF(B84+1>=$J$17,0,L72*(1+Captura!$D$35))","v":0},{"$f":"IF(B84+1>=$J$17,0,M72*(1+Captura!$D$35))","v":0},null,{"$f":"IF(B84=J$17,Captura!$L$29,0)","v":0},{"$f":"SUM(D84:F84,I84:N84)*Captura!$C$19","v":0},0,null,null,9,56,0,null,{"$f":"+V83*Captura!$O$9/12","v":0},0,0,{"$f":"IF(U84=J$17,Captura!$L$33,0)","v":0},null,{"$f":"IF(U84+1>=$J$17,0,AC72*(1+Captura!$D$35))","v":0},{"$f":"IF(U84+1>=$J$17,0,AD72*(1+Captura!$D$35))","v":0},{"$f":"IF(U84+1>=$J$17,0,AE72*(1+Captura!$D$35))","v":0},null,{"$f":"+(W84+AB84+AC84+AD84+AE84+AF84)*Captura!$C$19","v":0},0,null,0,0]
[null,57,"2030-12-04",{"$f":"IF(B85<J$17,Captura!$L$16,0)","v":0},null,null,null,0,null,null,{"$f":"IF(B85+1>=$J$17,0,K73*(1+Captura!$D$35))","v":0},{"$f":"IF(B85+1>=$J$17,0,L73*(1+Captura!$D$35))","v":0},{"$f":"IF(B85+1>=$J$17,0,M73*(1+Captura!$D$35))","v":0},null,{"$f":"IF(B85=J$17,Captura!$L$29,0)","v":0},{"$f":"SUM(D85:F85,I85:N85)*Captura!$C$19","v":0},0,null,null,10,57,0,null,{"$f":"+V84*Captura!$O$9/12","v":0},0,0,{"$f":"IF(U85=J$17,Captura!$L$33,0)","v":0},null,{"$f":"IF(U85+1>=$J$17,0,AC73*(1+Captura!$D$35))","v":0},{"$f":"IF(U85+1>=$J$17,0,AD73*(1+Captura!$D$35))","v":0},{"$f":"IF(U85+1>=$J$17,0,AE73*(1+Captura!$D$35))","v":0},null,{"$f":"+(W85+AB85+AC85+AD85+AE85+AF85)*Captura!$C$19","v":0},0,null,0,0]
[null,58,"2031-01-04",{"$f":"IF(B86<J$17,Captura!$L$16,0)","v":0},null,null,null,0,null,null,{"$f":"IF(B86+1>=$J$17,0,K74*(1+Captura!$D$35))","v":0},{"$f":"IF(B86+1>=$J$17,0,L74*(1+Captura!$D$35))","v":0},{"$f":"IF(B86+1>=$J$17,0,M74*(1+Captura!$D$35))","v":0},null,{"$f":"IF(B86=J$17,Captura!$L$29,0)","v":0},{"$f":"SUM(D86:F86,I86:N86)*Captura!$C$19","v":0},0,null,null,11,58,0,null,{"$f":"+V85*Captura!$O$9/12","v":0},0,0,{"$f":"IF(U86=J$17,Captura!$L$33,0)","v":0},null,{"$f":"IF(U86+1>=$J$17,0,AC74*(1+Captura!$D$35))","v":0},{"$f":"IF(U86+1>=$J$17,0,AD74*(1+Captura!$D$35))","v":0},{"$f":"IF(U86+1>=$J$17,0,AE74*(1+Captura!$D$35))","v":0},null,{"$f":"+(W86+AB86+AC86+AD86+AE86+AF86)*Captura!$C$19","v":0},0,null,0,0]
[null,59,"2031-02-04",{"$f":"IF(B87<J$17,Captura!$L$16,0)","v":0},null,null,null,0,null,null,{"$f":"IF(B87+1>=$J$17,0,K75*(1+Captura!$D$35))","v":0},{"$f":"IF(B87+1>=$J$17,0,L75*(1+Captura!$D$35))","v":0},{"$f":"IF(B87+1>=$J$17,0,M75*(1+Captura!$D$35))","v":0},null,{"$f":"IF(B87=J$17,Captura!$L$29,0)","v":0},{"$f":"SUM(D87:F87,I87:N87)*Captura!$C$19","v":0},0,null,null,12,59,0,null,{"$f":"+V86*Captura!$O$9/12","v":0},0,0,{"$f":"IF(U87=J$17,Captura!$L$33,0)","v":0},null,{"$f":"IF(U87+1>=$J$17,0,AC75*(1+Captura!$D$35))","v":0},{"$f":"IF(U87+1>=$J$17,0,AD75*(1+Captura!$D$35))","v":0},{"$f":"IF(U87+1>=$J$17,0,AE75*(1+Captura!$D$35))","v":0},null,{"$f":"+(W87+AB87+AC87+AD87+AE87+AF87)*Captura!$C$19","v":0},0,null,0,0]
[null,60,"2031-03-04",{"$f":"IF(B88<J$17,Captura!$L$16,0)","v":0},null,null,null,0,null,null,{"$f":"IF(B88+1>=$J$17,0,K76*(1+Captura!$D$35))","v":0},{"$f":"IF(B88+1>=$J$17,0,L76*(1+Captura!$D$35))","v":0},{"$f":"IF(B88+1>=$J$17,0,M76*(1+Captura!$D$35))","v":0},null,{"$f":"IF(B88=J$17,Captura!$L$29,0)","v":0},{"$f":"SUM(D88:F88,I88:N88)*Captura!$C$19","v":0},0,null,null,1,60,0,null,{"$f":"+V87*Captura!$O$9/12","v":0},0,0,{"$f":"IF(U88=J$17,Captura!$L$33,0)","v":0},null,{"$f":"IF(U88+1>=$J$17,0,AC76*(1+Captura!$D$35))","v":0},{"$f":"IF(U88+1>=$J$17,0,AD76*(1+Captura!$D$35))","v":0},{"$f":"IF(U88+1>=$J$17,0,AE76*(1+Captura!$D$35))","v":0},null,{"$f":"+(W88+AB88+AC88+AD88+AE88+AF88)*Captura!$C$19","v":0},0,null,0,0]
[]
[]
[]
[null,"Notas:"]
[null,"1. Esta cotización no es una autorización y no representa ninguna obligación para Leasing Mobile de México, S. A. de C. V."]
[null,"2. La información descrita en el presente documento está sujeta a cambios sin previo aviso."]
[null,"3. Esta cotización no considera gastos que el equipo requiera para su adquisición, uso o mantenimiento."]
[null,"4. Las rentas en depósito serán devueltas al cumplimiento de todas las obligaciones contractauales del Arrendatario."]
[]
[]
[]
[]
[]
[]
[]
[]
[]
[]
[null,"__________________________________"]
[null,"Leasing Mobile de Mexico, SA de CV"]
[null,{"$f":"+Captura!D31","v":"xxxx"}]
[null,{"$f":"+Captura!D32","v":"xxxx"}]
[null,{"$f":"+Captura!D33","v":"xxxx"}]

{"sheet":"Plazo 3","index":8,"n_rows":111,"n_cols":37,"rows_kept":111,"cut":false,"hidden":true,"merged":[[112,1,112,17],[22,4,22,5],[23,4,23,5],[106,1,106,16],[107,1,107,16],[108,1,108,16],[109,1,109,16],[16,35,16,36],[17,16,19,16],[18,4,20,5],[18,35,18,36],[110,1,110,16],[21,4,21,5],[12,10,12,16],[14,1,14,16],[3,15,3,16],[6,1,6,16],[7,1,7,16],[9,15,9,16],[11,10,11,16]]}
[]
[]
[]
[]
[]
[]
[null,"Cotización"]
[null,"Arrendamiento Puro"]
[]
[null,null,null,null,null,null,null,null,null,null,null,null,null,null,null,{"$f":"+Captura!N3","v":"2026-03-04"}]
[]
[null,"Cliente:",null,null,{"$f":"+Captura!D7","v":0},null,null,null,null,"Teléfono",{"$f":"+Captura!D9","v":0}]
[null,"Atención:",null,null,{"$f":"+Captura!D8","v":0},null,null,null,null,"E-mail",{"$f":"+Captura!D10","v":0}]
[null,null,null,null,null,null,null,null,null,null,null,null,null,null,null,null,{"$f":"+Captura!O40","v":"v. 20240220"}]
[]
[]
[null,"Tipo de equipo",null,null,{"$f":"+Captura!T7","v":"Vehículo utilitario"},null,null,"Plazo del arrendamiento",null,{"$f":"+Captura!M13","v":36},null,"Gestoría y Registro",null,{"$f":"+Captura!F23","v":"Pago único"},null,null,null,null,null,null,null,null,null,null,null,null,null,null,null,null,null,null,null,null,null,"Valor presente de flujos"]
[null,"Estado del equipo",null,null,{"$f":"+Captura!T17","v":"Nuevo"},null,null,"No. de rentas en depósito",null,{"$f":"+Captura!K8","v":1},null,"Equipo de geolocalizacióon",null,{"$f":"+Captura!F24","v":"Pago único"},null,null,{"$f":"+Captura!M36","v":0},null,null,null,null,null,null,null,null,null,null,null,null,null,null,null,null,null,null,{"$f":"NPV(Captura!$D$35/12,AJ29:AJ88)+AJ28","v":{"$error":"#DIV/0!"}},{"$f":"NPV(Captura!$D$35/12,AK29:AK88)+AK28","v":-1139.1879269568699}]
[null,"Descripción",null,null,{"$f":"+Captura!D15","v":0},null,null,"Comisión de apertura",null,{"$f":"+Captura!K9","v":0.03},null,"Seguro de daños",null,{"$f":"+Captura!T26","v":"Pago en renta"},null,null,null,null,null,null,null,null,null,null,null,null,null,null,null,null,null,null,null,null,null,"Tasa Interna de Retorno"]
[null,null,null,null,null,null,null,"Anticipo",null,{"$f":"+Captura!K10","v":0},null,"Placas y Tenencia",null,{"$f":"+Captura!T33","v":"Pago anual"},null,null,null,null,null,null,null,null,null,null,null,null,null,null,null,null,null,null,null,null,null,{"$f":"IRR(AJ28:AJ88,0.01)*12","v":{"$error":"#VALUE!"}},{"$f":"IRR(AK28:AK88,0.01)*12","v":{"$error":"#DIV/0!"}}]
[null,null,null,null,null,null,null,"Residual estimado",null,"Valor mercado",null,"Servicio de geolocalización",null,{"$f":"+Captura!T40","v":"Pago anual"},null,null,{"$f":"+Captura!M37","v":"Positivo"},null,null,null,null,null,null,null,null,null,null,null,null,null,null,null,null,null,null,"Capital Req.",{"$f":"+Captura!M34","v":0}]
[null,"Valor factura sin IVA",null,null,{"$f":"+Captura!G18","v":0},null,null,null,null,null,null,{"$f":"+Captura!I25","v":"Otro"},null,{"$f":"+Captura!F28","v":0},null,null,null,null,null,null,null,null,null,null,null,null,null,null,null,null,null,null,null,null,null,"VP / CR",{"$f":"+(AJ18+AK18)/AK21","v":{"$error":"#DIV/0!"}}]
[null,"IVA",null,null,{"$f":"+Captura!G19","v":0},null,null,null,null,null,null,null,null,null,null,null,"Regresar"]
[null,"Valor factua con IVA",null,null,{"$f":"+Captura!G20","v":0},null,null,null,null,null,null,null,null,null,null,null,null,null,null,null,null,null,null,null,null,null,null,null,null,null,null,null,null,null,null,"Indicador anualizado",{"$f":"+AK22/J17*12","v":{"$error":"#DIV/0!"}}]
[]
[null,"Periodo","Mes","Renta","Anticipo","Comisión de apertura","Rentas en depósito","Devolución de rentas en depósito","Gestoría y Registro","Equipo de geo localización","Seguro de daños","Placas y Tenencia","Servicio de geo localización",{"$f":"+L22","v":"Otro"},"Residual estimado","IVA","TOTAL",null,null,"Mes","Periodo","Fondeo","Comisión de apertura","Intereses","Capital","Pago","Bullet","Equipo de geo localización","Seguro de daños","Placas y Tenencia","Servicio de geo localización","Otro","IVA","TOTAL",null,"Flujo Activo sin IVA","Flujo Pasivo sin IVA"]
[]
[null,0,{"$f":"+P10","v":"2026-03-04"},{"$f":"+Captura!M16+Resumen!K29+Resumen!K30","v":{"$error":"#DIV/0!"}},{"$f":"+Captura!K10","v":0},{"$f":"+Captura!M18","v":0},{"$f":"+Captura!M19","v":0},{"$f":"IF(B28=J$17,-G$28,0)","v":0},{"$f":"+Captura!M20","v":0},{"$f":"+Captura!M21","v":0},{"$f":"+Captura!M22","v":0},{"$f":"+Captura!M23","v":0},{"$f":"+Captura!M24","v":0},{"$f":"+Captura!M25","v":0},{"$f":"IF(B28=J$17,Captura!$M$29,0)","v":0},{"$f":"SUM(D28:F28,I28:N28)*Captura!$C$19","v":{"$error":"#DIV/0!"}},{"$f":"SUM(D28:P28)-O28","v":{"$error":"#DIV/0!"}},null,null,1,{"$f":"+B28","v":0},{"$f":"+Captura!O8","v":0},{"$f":"+Captura!M31","v":0},null,null,null,null,{"$f":"+J28","v":0},{"$f":"+Captura!G25","v":0},{"$f":"+Captura!G26","v":0},{"$f":"+Captura!G27","v":380},{"$f":"+N28","v":0},{"$f":"+(W28+AB28+AC28+AD28+AE28+AF28)*Captura!$C$19","v":60.800000000000004},{"$f":"SUM(W28,Z28:AG28)","v":440.8},null,{"$f":"-E22+(Q28-P28)+O28","v":{"$error":"#DIV/0!"}},{"$f":"+V28-(AH28-AG28)","v":-380}]
[null,1,{"$f":"EDATE(C28,1)","v":"2026-04-04"},{"$f":"IF(B29<J$17,Captura!$M$16,0)+Resumen!$K$29+Resumen!$K$30","v":{"$error":"#DIV/0!"}},null,null,null,0,null,null,0,0,0,null,{"$f":"IF(B29=J$17,Captura!$M$29,0)","v":0},{"$f":"SUM(D29:F29,I29:N29)*Captura!$C$19","v":{"$error":"#DIV/0!"}},{"$f":"SUM(D29:P29)-O29","v":{"$error":"#DIV/0!"}},null,null,{"$f":"IF(T28=12,1,T28+1)","v":2},{"$f":"+B29","v":1},{"$f":"+V28-Y29-AA29","v":0},null,{"$f":"+V28*Captura!$O$9/12","v":0},{"$f":"+Z29-X29","v":0},{"$f":"+Captura!M30","v":0},{"$f":"IF(U29=J$17,Captura!$M$33,0)","v":0},null,0,0,0,null,{"$f":"+(W29+AB29+AC29+AD29+AE29+AF29)*Captura!$C$19","v":0},{"$f":"SUM(W29,Z29:AG29)","v":0},null,{"$f":"Q29-P29+O29","v":{"$error":"#DIV/0!"}},{"$f":"-(AH29-AG29)","v":0}]
[null,2,{"$f":"EDATE(C29,1)","v":"2026-05-04"},{"$f":"IF(B30<J$17,Captura!$M$16,0)+Resumen!$K$29+Resumen!$K$30","v":{"$error":"#DIV/0!"}},null,null,null,0,null,null,0,0,0,null,{"$f":"IF(B30=J$17,Captura!$M$29,0)","v":0},{"$f":"SUM(D30:F30,I30:N30)*Captura!$C$19","v":{"$error":"#DIV/0!"}},{"$error":"#DIV/0!"},null,null,{"$f":"IF(T29=12,1,T29+1)","v":3},2,{"$f":"+V29-Y30-AA30","v":0},null,{"$f":"+V29*Captura!$O$9/12","v":0},{"$f":"+Z30-X30","v":0},{"$f":"IF(U30>J$17,0,Z29)","v":0},{"$f":"IF(U30=J$17,Captura!$M$33,0)","v":0},null,0,0,0,null,{"$f":"+(W30+AB30+AC30+AD30+AE30+AF30)*Captura!$C$19","v":0},0,null,{"$f":"Q30-P30+O30","v":{"$error":"#DIV/0!"}},{"$f":"-(AH30-AG30)","v":0}]
[null,3,"2026-06-04",{"$f":"IF(B31<J$17,Captura!$M$16,0)+Resumen!$K$29+Resumen!$K$30","v":{"$error":"#DIV/0!"}},null,null,null,0,null,null,0,0,0,null,{"$f":"IF(B31=J$17,Captura!$M$29,0)","v":0},{"$f":"SUM(D31:F31,I31:N31)*Captura!$C$19","v":{"$error":"#DIV/0!"}},{"$error":"#DIV/0!"},null,null,4,3,0,null,{"$f":"+V30*Captura!$O$9/12","v":0},0,{"$f":"IF(U31>J$17,0,Z30)","v":0},{"$f":"IF(U31=J$17,Captura!$M$33,0)","v":0},null,0,0,0,null,{"$f":"+(W31+AB31+AC31+AD31+AE31+AF31)*Captura!$C$19","v":0},0,null,{"$error":"#DIV/0!"},0]
[null,4,"2026-07-04",{"$f":"IF(B32<J$17,Captura!$M$16,0)+Resumen!$K$29+Resumen!$K$30","v":{"$error":"#DIV/0!"}},null,null,null,0,null,null,0,0,0,null,{"$f":"IF(B32=J$17,Captura!$M$29,0)","v":0},{"$f":"SUM(D32:F32,I32:N32)*Captura!$C$19","v":{"$error":"#DIV/0!"}},{"$error":"#DIV/0!"},null,null,5,4,0,null,{"$f":"+V31*Captura!$O$9/12","v":0},0,0,{"$f":"IF(U32=J$17,Captura!$M$33,0)","v":0},null,0,0,0,null,{"$f":"+(W32+AB32+AC32+AD32+AE32+AF32)*Captura!$C$19","v":0},0,null,{"$error":"#DIV/0!"},0]
[null,5,"2026-08-04",{"$f":"IF(B33<J$17,Captura!$M$16,0)+Resumen!$K$29+Resumen!$K$30","v":{"$error":"#DIV/0!"}},null,null,null,0,null,null,0,0,0,null,{"$f":"IF(B33=J$17,Captura!$M$29,0)","v":0},{"$f":"SUM(D33:F33,I33:N33)*Captura!$C$19","v":{"$error":"#DIV/0!"}},{"$error":"#DIV/0!"},null,null,6,5,0,null,{"$f":"+V32*Captura!$O$9/12","v":0},0,0,{"$f":"IF(U33=J$17,Captura!$M$33,0)","v":0},null,0,0,0,null,{"$f":"+(W33+AB33+AC33+AD33+AE33+AF33)*Captura!$C$19","v":0},0,null,{"$error":"#DIV/0!"},0]
[null,6,"2026-09-04",{"$f":"IF(B34<J$17,Captura!$M$16,0)+Resumen!$K$29+Resumen!$K$30","v":{"$error":"#DIV/0!"}},null,null,null,0,null,null,0,0,0,null,{"$f":"IF(B34=J$17,Captura!$M$29,0)","v":0},{"$f":"SUM(D34:F34,I34:N34)*Captura!$C$19","v":{"$error":"#DIV/0!"}},{"$error":"#DIV/0!"},null,null,7,6,0,null,{"$f":"+V33*Captura!$O$9/12","v":0},0,0,{"$f":"IF(U34=J$17,Captura!$M$33,0)","v":0},null,0,0,0,null,{"$f":"+(W34+AB34+AC34+AD34+AE34+AF34)*Captura!$C$19","v":0},0,null,{"$error":"#DIV/0!"},0]
[null,7,"2026-10-04",{"$f":"IF(B35<J$17,Captura!$M$16,0)+Resumen!$K$29+Resumen!$K$30","v":{"$error":"#DIV/0!"}},null,null,null,0,null,null,0,0,0,null,{"$f":"IF(B35=J$17,Captura!$M$29,0)","v":0},{"$f":"SUM(D35:F35,I35:N35)*Captura!$C$19","v":{"$error":"#DIV/0!"}},{"$error":"#DIV/0!"},null,null,8,7,0,null,{"$f":"+V34*Captura!$O$9/12","v":0},0,0,{"$f":"IF(U35=J$17,Captura!$M$33,0)","v":0},null,0,0,0,null,{"$f":"+(W35+AB35+AC35+AD35+AE35+AF35)*Captura!$C$19","v":0},0,null,{"$error":"#DIV/0!"},0]
[null,8,"2026-11-04",{"$f":"IF(B36<J$17,Captura!$M$16,0)+Resumen!$K$29+Resumen!$K$30","v":{"$error":"#DIV/0!"}},null,null,null,0,null,null,0,0,0,null,{"$f":"IF(B36=J$17,Captura!$M$29,0)","v":0},{"$f":"SUM(D36:F36,I36:N36)*Captura!$C$19","v":{"$error":"#DIV/0!"}},{"$error":"#DIV/0!"},null,null,9,8,0,null,{"$f":"+V35*Captura!$O$9/12","v":0},0,0,{"$f":"IF(U36=J$17,Captura!$M$33,0)","v":0},null,0,0,0,null,{"$f":"+(W36+AB36+AC36+AD36+AE36+AF36)*Captura!$C$19","v":0},0,null,{"$error":"#DIV/0!"},0]
[null,9,"2026-12-04",{"$f":"IF(B37<J$17,Captura!$M$16,0)+Resumen!$K$29+Resumen!$K$30","v":{"$error":"#DIV/0!"}},null,null,null,0,null,null,0,0,0,null,{"$f":"IF(B37=J$17,Captura!$M$29,0)","v":0},{"$f":"SUM(D37:F37,I37:N37)*Captura!$C$19","v":{"$error":"#DIV/0!"}},{"$error":"#DIV/0!"},null,null,10,9,0,null,{"$f":"+V36*Captura!$O$9/12","v":0},0,0,{"$f":"IF(U37=J$17,Captura!$M$33,0)","v":0},null,0,0,0,null,{"$f":"+(W37+AB37+AC37+AD37+AE37+AF37)*Captura!$C$19","v":0},0,null,{"$error":"#DIV/0!"},0]
[null,10,"2027-01-04",{"$f":"IF(B38<J$17,Captura!$M$16,0)+Resumen!$K$29+Resumen!$K$30","v":{"$error":"#DIV/0!"}},null,null,null,0,null,null,0,0,0,null,{"$f":"IF(B38=J$17,Captura!$M$29,0)","v":0},{"$f":"SUM(D38:F38,I38:N38)*Captura!$C$19","v":{"$error":"#DIV/0!"}},{"$error":"#DIV/0!"},null,null,11,10,0,null,{"$f":"+V37*Captura!$O$9/12","v":0},0,0,{"$f":"IF(U38=J$17,Captura!$M$33,0)","v":0},null,0,0,0,null,{"$f":"+(W38+AB38+AC38+AD38+AE38+AF38)*Captura!$C$19","v":0},0,null,{"$error":"#DIV/0!"},0]
[null,11,"2027-02-04",{"$f":"IF(B39<J$17,Captura!$M$16,0)+Resumen!$K$29+Resumen!$K$30","v":{"$error":"#DIV/0!"}},null,null,null,0,null,null,0,0,0,null,{"$f":"IF(B39=J$17,Captura!$M$29,0)","v":0},{"$f":"SUM(D39:F39,I39:N39)*Captura!$C$19","v":{"$error":"#DIV/0!"}},{"$error":"#DIV/0!"},null,null,12,11,0,null,{"$f":"+V38*Captura!$O$9/12","v":0},0,0,{"$f":"IF(U39=J$17,Captura!$M$33,0)","v":0},null,0,0,0,null,{"$f":"+(W39+AB39+AC39+AD39+AE39+AF39)*Captura!$C$19","v":0},0,null,{"$error":"#DIV/0!"},0]
[null,12,"2027-03-04",{"$f":"IF(B40<J$17,Captura!$M$16,0)+Resumen!$K$29+Resumen!$K$30","v":{"$error":"#DIV/0!"}},null,null,null,0,null,null,{"$f":"IF(B40+1>=$J$17,0,K28*(1+Captura!$D$35))","v":0},{"$f":"IF(B40+1>=$J$17,0,L28*(1+Captura!$D$35))","v":0},{"$f":"IF(B40+1>=$J$17,0,M28*(1+Captura!$D$35))","v":0},null,{"$f":"IF(B40=J$17,Captura!$M$29,0)","v":0},{"$f":"SUM(D40:F40,I40:N40)*Captura!$C$19","v":{"$error":"#DIV/0!"}},{"$error":"#DIV/0!"},null,null,1,12,0,null,{"$f":"+V39*Captura!$O$9/12","v":0},0,0,{"$f":"IF(U40=J$17,Captura!$M$33,0)","v":0},null,{"$f":"IF(U40+1>=$J$17,0,AC28*(1+Captura!$D$35))","v":0},{"$f":"IF(U40+1>=$J$17,0,AD28*(1+Captura!$D$35))","v":0},{"$f":"IF(U40+1>=$J$17,0,AE28*(1+Captura!$D$35))","v":395.2},null,{"$f":"+(W40+AB40+AC40+AD40+AE40+AF40)*Captura!$C$19","v":63.231999999999999},458.43200000000002,null,{"$error":"#DIV/0!"},-395.20000000000005]
[null,13,"2027-04-04",{"$f":"IF(B41<J$17,Captura!$M$16,0)+Resumen!$K$29+Resumen!$K$30","v":{"$error":"#DIV/0!"}},null,null,null,0,null,null,{"$f":"IF(B41+1>=$J$17,0,K29*(1+Captura!$D$35))","v":0},{"$f":"IF(B41+1>=$J$17,0,L29*(1+Captura!$D$35))","v":0},{"$f":"IF(B41+1>=$J$17,0,M29*(1+Captura!$D$35))","v":0},null,{"$f":"IF(B41=J$17,Captura!$M$29,0)","v":0},{"$f":"SUM(D41:F41,I41:N41)*Captura!$C$19","v":{"$error":"#DIV/0!"}},{"$error":"#DIV/0!"},null,null,2,13,0,null,{"$f":"+V40*Captura!$O$9/12","v":0},0,0,{"$f":"IF(U41=J$17,Captura!$M$33,0)","v":0},null,{"$f":"IF(U41+1>=$J$17,0,AC29*(1+Captura!$D$35))","v":0},{"$f":"IF(U41+1>=$J$17,0,AD29*(1+Captura!$D$35))","v":0},{"$f":"IF(U41+1>=$J$17,0,AE29*(1+Captura!$D$35))","v":0},null,{"$f":"+(W41+AB41+AC41+AD41+AE41+AF41)*Captura!$C$19","v":0},0,null,{"$error":"#DIV/0!"},0]
[null,14,"2027-05-04",{"$f":"IF(B42<J$17,Captura!$M$16,0)+Resumen!$K$29+Resumen!$K$30","v":{"$error":"#DIV/0!"}},null,null,null,0,null,null,{"$f":"IF(B42+1>=$J$17,0,K30*(1+Captura!$D$35))","v":0},{"$f":"IF(B42+1>=$J$17,0,L30*(1+Captura!$D$35))","v":0},{"$f":"IF(B42+1>=$J$17,0,M30*(1+Captura!$D$35))","v":0},null,{"$f":"IF(B42=J$17,Captura!$M$29,0)","v":0},{"$f":"SUM(D42:F42,I42:N42)*Captura!$C$19","v":{"$error":"#DIV/0!"}},{"$error":"#DIV/0!"},null,null,3,14,0,null,{"$f":"+V41*Captura!$O$9/12","v":0},0,0,{"$f":"IF(U42=J$17,Captura!$M$33,0)","v":0},null,{"$f":"IF(U42+1>=$J$17,0,AC30*(1+Captura!$D$35))","v":0},{"$f":"IF(U42+1>=$J$17,0,AD30*(1+Captura!$D$35))","v":0},{"$f":"IF(U42+1>=$J$17,0,AE30*(1+Captura!$D$35))","v":0},null,{"$f":"+(W42+AB42+AC42+AD42+AE42+AF42)*Captura!$C$19","v":0},0,null,{"$error":"#DIV/0!"},0]
[null,15,"2027-06-04",{"$f":"IF(B43<J$17,Captura!$M$16,0)+Resumen!$K$29+Resumen!$K$30","v":{"$error":"#DIV/0!"}},null,null,null,0,null,null,{"$f":"IF(B43+1>=$J$17,0,K31*(1+Captura!$D$35))","v":0},{"$f":"IF(B43+1>=$J$17,0,L31*(1+Captura!$D$35))","v":0},{"$f":"IF(B43+1>=$J$17,0,M31*(1+Captura!$D$35))","v":0},null,{"$f":"IF(B43=J$17,Captura!$M$29,0)","v":0},{"$f":"SUM(D43:F43,I43:N43)*Captura!$C$19","v":{"$error":"#DIV/0!"}},{"$error":"#DIV/0!"},null,null,4,15,0,null,{"$f":"+V42*Captura!$O$9/12","v":0},0,0,{"$f":"IF(U43=J$17,Captura!$M$33,0)","v":0},null,{"$f":"IF(U43+1>=$J$17,0,AC31*(1+Captura!$D$35))","v":0},{"$f":"IF(U43+1>=$J$17,0,AD31*(1+Captura!$D$35))","v":0},{"$f":"IF(U43+1>=$J$17,0,AE31*(1+Captura!$D$35))","v":0},null,{"$f":"+(W43+AB43+AC43+AD43+AE43+AF43)*Captura!$C$19","v":0},0,null,{"$error":"#DIV/0!"},0]
[null,16,"2027-07-04",{"$f":"IF(B44<J$17,Captura!$M$16,0)+Resumen!$K$29+Resumen!$K$30","v":{"$error":"#DIV/0!"}},null,null,null,0,null,null,{"$f":"IF(B44+1>=$J$17,0,K32*(1+Captura!$D$35))","v":0},{"$f":"IF(B44+1>=$J$17,0,L32*(1+Captura!$D$35))","v":0},{"$f":"IF(B44+1>=$J$17,0,M32*(1+Captura!$D$35))","v":0},null,{"$f":"IF(B44=J$17,Captura!$M$29,0)","v":0},{"$f":"SUM(D44:F44,I44:N44)*Captura!$C$19","v":{"$error":"#DIV/0!"}},{"$error":"#DIV/0!"},null,null,5,16,0,null,{"$f":"+V43*Captura!$O$9/12","v":0},0,0,{"$f":"IF(U44=J$17,Captura!$M$33,0)","v":0},null,{"$f":"IF(U44+1>=$J$17,0,AC32*(1+Captura!$D$35))","v":0},{"$f":"IF(U44+1>=$J$17,0,AD32*(1+Captura!$D$35))","v":0},{"$f":"IF(U44+1>=$J$17,0,AE32*(1+Captura!$D$35))","v":0},null,{"$f":"+(W44+AB44+AC44+AD44+AE44+AF44)*Captura!$C$19","v":0},0,null,{"$error":"#DIV/0!"},0]
[null,17,"2027-08-04",{"$f":"IF(B45<J$17,Captura!$M$16,0)+Resumen!$K$29+Resumen!$K$30","v":{"$error":"#DIV/0!"}},null,null,null,0,null,null,{"$f":"IF(B45+1>=$J$17,0,K33*(1+Captura!$D$35))","v":0},{"$f":"IF(B45+1>=$J$17,0,L33*(1+Captura!$D$35))","v":0},{"$f":"IF(B45+1>=$J$17,0,M33*(1+Captura!$D$35))","v":0},null,{"$f":"IF(B45=J$17,Captura!$M$29,0)","v":0},{"$f":"SUM(D45:F45,I45:N45)*Captura!$C$19","v":{"$error":"#DIV/0!"}},{"$error":"#DIV/0!"},null,null,6,17,0,null,{"$f":"+V44*Captura!$O$9/12","v":0},0,0,{"$f":"IF(U45=J$17,Captura!$M$33,0)","v":0},null,{"$f":"IF(U45+1>=$J$17,0,AC33*(1+Captura!$D$35))","v":0},{"$f":"IF(U45+1>=$J$17,0,AD33*(1+Captura!$D$35))","v":0},{"$f":"IF(U45+1>=$J$17,0,AE33*(1+Captura!$D$35))","v":0},null,{"$f":"+(W45+AB45+AC45+AD45+AE45+AF45)*Captura!$C$19","v":0},0,null,{"$error":"#DIV/0!"},0]
[null,18,"2027-09-04",{"$f":"IF(B46<J$17,Captura!$M$16,0)+Resumen!$K$29+Resumen!$K$30","v":{"$error":"#DIV/0!"}},null,null,null,0,null,null,{"$f":"IF(B46+1>=$J$17,0,K34*(1+Captura!$D$35))","v":0},{"$f":"IF(B46+1>=$J$17,0,L34*(1+Captura!$D$35))","v":0},{"$f":"IF(B46+1>=$J$17,0,M34*(1+Captura!$D$35))","v":0},null,{"$f":"IF(B46=J$17,Captura!$M$29,0)","v":0},{"$f":"SUM(D46:F46,I46:N46)*Captura!$C$19","v":{"$error":"#DIV/0!"}},{"$error":"#DIV/0!"},null,null,7,18,0,null,{"$f":"+V45*Captura!$O$9/12","v":0},0,0,{"$f":"IF(U46=J$17,Captura!$M$33,0)","v":0},null,{"$f":"IF(U46+1>=$J$17,0,AC34*(1+Captura!$D$35))","v":0},{"$f":"IF(U46+1>=$J$17,0,AD34*(1+Captura!$D$35))","v":0},{"$f":"IF(U46+1>=$J$17,0,AE34*(1+Captura!$D$35))","v":0},null,{"$f":"+(W46+AB46+AC46+AD46+AE46+AF46)*Captura!$C$19","v":0},0,null,{"$error":"#DIV/0!"},0]
[null,19,"2027-10-04",{"$f":"IF(B47<J$17,Captura!$M$16,0)+Resumen!$K$29+Resumen!$K$30","v":{"$error":"#DIV/0!"}},null,null,null,0,null,null,{"$f":"IF(B47+1>=$J$17,0,K35*(1+Captura!$D$35))","v":0},{"$f":"IF(B47+1>=$J$17,0,L35*(1+Captura!$D$35))","v":0},{"$f":"IF(B47+1>=$J$17,0,M35*(1+Captura!$D$35))","v":0},null,{"$f":"IF(B47=J$17,Captura!$M$29,0)","v":0},{"$f":"SUM(D47:F47,I47:N47)*Captura!$C$19","v":{"$error":"#DIV/0!"}},{"$error":"#DIV/0!"},null,null,8,19,0,null,{"$f":"+V46*Captura!$O$9/12","v":0},0,0,{"$f":"IF(U47=J$17,Captura!$M$33,0)","v":0},null,{"$f":"IF(U47+1>=$J$17,0,AC35*(1+Captura!$D$35))","v":0},{"$f":"IF(U47+1>=$J$17,0,AD35*(1+Captura!$D$35))","v":0},{"$f":"IF(U47+1>=$J$17,0,AE35*(1+Captura!$D$35))","v":0},null,{"$f":"+(W47+AB47+AC47+AD47+AE47+AF47)*Captura!$C$19","v":0},0,null,{"$error":"#DIV/0!"},0]
[null,20,"2027-11-04",{"$f":"IF(B48<J$17,Captura!$M$16,0)+Resumen!$K$29+Resumen!$K$30","v":{"$error":"#DIV/0!"}},null,null,null,0,null,null,{"$f":"IF(B48+1>=$J$17,0,K36*(1+Captura!$D$35))","v":0},{"$f":"IF(B48+1>=$J$17,0,L36*(1+Captura!$D$35))","v":0},{"$f":"IF(B48+1>=$J$17,0,M36*(1+Captura!$D$35))","v":0},null,{"$f":"IF(B48=J$17,Captura!$M$29,0)","v":0},{"$f":"SUM(D48:F48,I48:N48)*Captura!$C$19","v":{"$error":"#DIV/0!"}},{"$error":"#DIV/0!"},null,null,9,20,0,null,{"$f":"+V47*Captura!$O$9/12","v":0},0,0,{"$f":"IF(U48=J$17,Captura!$M$33,0)","v":0},null,{"$f":"IF(U48+1>=$J$17,0,AC36*(1+Captura!$D$35))","v":0},{"$f":"IF(U48+1>=$J$17,0,AD36*(1+Captura!$D$35))","v":0},{"$f":"IF(U48+1>=$J$17,0,AE36*(1+Captura!$D$35))","v":0},null,{"$f":"+(W48+AB48+AC48+AD48+AE48+AF48)*Captura!$C$19","v":0},0,null,{"$error":"#DIV/0!"},0]
[null,21,"2027-12-04",{"$f":"IF(B49<J$17,Captura!$M$16,0)+Resumen!$K$29+Resumen!$K$30","v":{"$error":"#DIV/0!"}},null,null,null,0,null,null,{"$f":"IF(B49+1>=$J$17,0,K37*(1+Captura!$D$35))","v":0},{"$f":"IF(B49+1>=$J$17,0,L37*(1+Captura!$D$35))","v":0},{"$f":"IF(B49+1>=$J$17,0,M37*(1+Captura!$D$35))","v":0},null,{"$f":"IF(B49=J$17,Captura!$M$29,0)","v":0},{"$f":"SUM(D49:F49,I49:N49)*Captura!$C$19","v":{"$error":"#DIV/0!"}},{"$error":"#DIV/0!"},null,null,10,21,0,null,{"$f":"+V48*Captura!$O$9/12","v":0},0,0,{"$f":"IF(U49=J$17,Captura!$M$33,0)","v":0},null,{"$f":"IF(U49+1>=$J$17,0,AC37*(1+Captura!$D$35))","v":0},{"$f":"IF(U49+1>=$J$17,0,AD37*(1+Captura!$D$35))","v":0},{"$f":"IF(U49+1>=$J$17,0,AE37*(1+Captura!$D$35))","v":0},null,{"$f":"+(W49+AB49+AC49+AD49+AE49+AF49)*Captura!$C$19","v":0},0,null,{"$error":"#DIV/0!"},0]
[null,22,"2028-01-04",{"$f":"IF(B50<J$17,Captura!$M$16,0)+Resumen!$K$29+Resumen!$K$30","v":{"$error":"#DIV/0!"}},null,null,null,0,null,null,{"$f":"IF(B50+1>=$J$17,0,K38*(1+Captura!$D$35))","v":0},{"$f":"IF(B50+1>=$J$17,0,L38*(1+Captura!$D$35))","v":0},{"$f":"IF(B50+1>=$J$17,0,M38*(1+Captura!$D$35))","v":0},null,{"$f":"IF(B50=J$17,Captura!$M$29,0)","v":0},{"$f":"SUM(D50:F50,I50:N50)*Captura!$C$19","v":{"$error":"#DIV/0!"}},{"$error":"#DIV/0!"},null,null,11,22,0,null,{"$f":"+V49*Captura!$O$9/12","v":0},0,0,{"$f":"IF(U50=J$17,Captura!$M$33,0)","v":0},null,{"$f":"IF(U50+1>=$J$17,0,AC38*(1+Captura!$D$35))","v":0},{"$f":"IF(U50+1>=$J$17,0,AD38*(1+Captura!$D$35))","v":0},{"$f":"IF(U50+1>=$J$17,0,AE38*(1+Captura!$D$35))","v":0},null,{"$f":"+(W50+AB50+AC50+AD50+AE50+AF50)*Captura!$C$19","v":0},0,null,{"$error":"#DIV/0!"},0]
[null,23,"2028-02-04",{"$f":"IF(B51<J$17,Captura!$M$16,0)+Resumen!$K$29+Resumen!$K$30","v":{"$error":"#DIV/0!"}},null,null,null,0,null,null,{"$f":"IF(B51+1>=$J$17,0,K39*(1+Captura!$D$35))","v":0},{"$f":"IF(B51+1>=$J$17,0,L39*(1+Captura!$D$35))","v":0},{"$f":"IF(B51+1>=$J$17,0,M39*(1+Captura!$D$35))","v":0},null,{"$f":"IF(B51=J$17,Captura!$M$29,0)","v":0},{"$f":"SUM(D51:F51,I51:N51)*Captura!$C$19","v":{"$error":"#DIV/0!"}},{"$error":"#DIV/0!"},null,null,12,23,0,null,{"$f":"+V50*Captura!$O$9/12","v":0},0,0,{"$f":"IF(U51=J$17,Captura!$M$33,0)","v":0},null,{"$f":"IF(U51+1>=$J$17,0,AC39*(1+Captura!$D$35))","v":0},{"$f":"IF(U51+1>=$J$17,0,AD39*(1+Captura!$D$35))","v":0},{"$f":"IF(U51+1>=$J$17,0,AE39*(1+Captura!$D$35))","v":0},null,{"$f":"+(W51+AB51+AC51+AD51+AE51+AF51)*Captura!$C$19","v":0},0,null,{"$error":"#DIV/0!"},0]
[null,24,"2028-03-04",{"$f":"IF(B52<J$17,Captura!$M$16,0)+Resumen!$K$29+Resumen!$K$30","v":{"$error":"#DIV/0!"}},null,null,null,0,null,null,{"$f":"IF(B52+1>=$J$17,0,K40*(1+Captura!$D$35))","v":0},{"$f":"IF(B52+1>=$J$17,0,L40*(1+Captura!$D$35))","v":0},{"$f":"IF(B52+1>=$J$17,0,M40*(1+Captura!$D$35))","v":0},null,{"$f":"IF(B52=J$17,Captura!$M$29,0)","v":0},{"$f":"SUM(D52:F52,I52:N52)*Captura!$C$19","v":{"$error":"#DIV/0!"}},{"$error":"#DIV/0!"},null,null,1,24,0,null,{"$f":"+V51*Captura!$O$9/12","v":0},0,0,{"$f":"IF(U52=J$17,Captura!$M$33,0)","v":0},null,{"$f":"IF(U52+1>=$J$17,0,AC40*(1+Captura!$D$35))","v":0},{"$f":"IF(U52+1>=$J$17,0,AD40*(1+Captura!$D$35))","v":0},{"$f":"IF(U52+1>=$J$17,0,AE40*(1+Captura!$D$35))","v":411.00799999999998},null,{"$f":"+(W52+AB52+AC52+AD52+AE52+AF52)*Captura!$C$19","v":65.761279999999999},476.76927999999998,null,{"$error":"#DIV/0!"},-411.00799999999998]
[null,25,"2028-04-04",{"$f":"IF(B53<J$17,Captura!$M$16,0)+Resumen!$K$29+Resumen!$K$30","v":{"$error":"#DIV/0!"}},null,null,null,0,null,null,{"$f":"IF(B53+1>=$J$17,0,K41*(1+Captura!$D$35))","v":0},{"$f":"IF(B53+1>=$J$17,0,L41*(1+Captura!$D$35))","v":0},{"$f":"IF(B53+1>=$J$17,0,M41*(1+Captura!$D$35))","v":0},null,{"$f":"IF(B53=J$17,Captura!$M$29,0)","v":0},{"$f":"SUM(D53:F53,I53:N53)*Captura!$C$19","v":{"$error":"#DIV/0!"}},{"$error":"#DIV/0!"},null,null,2,25,0,null,{"$f":"+V52*Captura!$O$9/12","v":0},0,0,{"$f":"IF(U53=J$17,Captura!$M$33,0)","v":0},null,{"$f":"IF(U53+1>=$J$17,0,AC41*(1+Captura!$D$35))","v":0},{"$f":"IF(U53+1>=$J$17,0,AD41*(1+Captura!$D$35))","v":0},{"$f":"IF(U53+1>=$J$17,0,AE41*(1+Captura!$D$35))","v":0},null,{"$f":"+(W53+AB53+AC53+AD53+AE53+AF53)*Captura!$C$19","v":0},0,null,{"$error":"#DIV/0!"},0]
[null,26,"2028-05-04",{"$f":"IF(B54<J$17,Captura!$M$16,0)+Resumen!$K$29+Resumen!$K$30","v":{"$error":"#DIV/0!"}},null,null,null,0,null,null,{"$f":"IF(B54+1>=$J$17,0,K42*(1+Captura!$D$35))","v":0},{"$f":"IF(B54+1>=$J$17,0,L42*(1+Captura!$D$35))","v":0},{"$f":"IF(B54+1>=$J$17,0,M42*(1+Captura!$D$35))","v":0},null,{"$f":"IF(B54=J$17,Captura!$M$29,0)","v":0},{"$f":"SUM(D54:F54,I54:N54)*Captura!$C$19","v":{"$error":"#DIV/0!"}},{"$error":"#DIV/0!"},null,null,3,26,0,null,{"$f":"+V53*Captura!$O$9/12","v":0},0,0,{"$f":"IF(U54=J$17,Captura!$M$33,0)","v":0},null,{"$f":"IF(U54+1>=$J$17,0,AC42*(1+Captura!$D$35))","v":0},{"$f":"IF(U54+1>=$J$17,0,AD42*(1+Captura!$D$35))","v":0},{"$f":"IF(U54+1>=$J$17,0,AE42*(1+Captura!$D$35))","v":0},null,{"$f":"+(W54+AB54+AC54+AD54+AE54+AF54)*Captura!$C$19","v":0},0,null,{"$error":"#DIV/0!"},0]
[null,27,"2028-06-04",{"$f":"IF(B55<J$17,Captura!$M$16,0)+Resumen!$K$29+Resumen!$K$30","v":{"$error":"#DIV/0!"}},null,null,null,0,null,null,{"$f":"IF(B55+1>=$J$17,0,K43*(1+Captura!$D$35))","v":0},{"$f":"IF(B55+1>=$J$17,0,L43*(1+Captura!$D$35))","v":0},{"$f":"IF(B55+1>=$J$17,0,M43*(1+Captura!$D$35))","v":0},null,{"$f":"IF(B55=J$17,Captura!$M$29,0)","v":0},{"$f":"SUM(D55:F55,I55:N55)*Captura!$C$19","v":{"$error":"#DIV/0!"}},{"$error":"#DIV/0!"},null,null,4,27,0,null,{"$f":"+V54*Captura!$O$9/12","v":0},0,0,{"$f":"IF(U55=J$17,Captura!$M$33,0)","v":0},null,{"$f":"IF(U55+1>=$J$17,0,AC43*(1+Captura!$D$35))","v":0},{"$f":"IF(U55+1>=$J$17,0,AD43*(1+Captura!$D$35))","v":0},{"$f":"IF(U55+1>=$J$17,0,AE43*(1+Captura!$D$35))","v":0},null,{"$f":"+(W55+AB55+AC55+AD55+AE55+AF55)*Captura!$C$19","v":0},0,null,{"$error":"#DIV/0!"},0]
[null,28,"2028-07-04",{"$f":"IF(B56<J$17,Captura!$M$16,0)+Resumen!$K$29+Resumen!$K$30","v":{"$error":"#DIV/0!"}},null,null,null,0,null,null,{"$f":"IF(B56+1>=$J$17,0,K44*(1+Captura!$D$35))","v":0},{"$f":"IF(B56+1>=$J$17,0,L44*(1+Captura!$D$35))","v":0},{"$f":"IF(B56+1>=$J$17,0,M44*(1+Captura!$D$35))","v":0},null,{"$f":"IF(B56=J$17,Captura!$M$29,0)","v":0},{"$f":"SUM(D56:F56,I56:N56)*Captura!$C$19","v":{"$error":"#DIV/0!"}},{"$error":"#DIV/0!"},null,null,5,28,0,null,{"$f":"+V55*Captura!$O$9/12","v":0},0,0,{"$f":"IF(U56=J$17,Captura!$M$33,0)","v":0},null,{"$f":"IF(U56+1>=$J$17,0,AC44*(1+Captura!$D$35))","v":0},{"$f":"IF(U56+1>=$J$17,0,AD44*(1+Captura!$D$35))","v":0},{"$f":"IF(U56+1>=$J$17,0,AE44*(1+Captura!$D$35))","v":0},null,{"$f":"+(W56+AB56+AC56+AD56+AE56+AF56)*Captura!$C$19","v":0},0,null,{"$error":"#DIV/0!"},0]
[null,29,"2028-08-04",{"$f":"IF(B57<J$17,Captura!$M$16,0)+Resumen!$K$29+Resumen!$K$30","v":{"$error":"#DIV/0!"}},null,null,null,0,null,null,{"$f":"IF(B57+1>=$J$17,0,K45*(1+Captura!$D$35))","v":0},{"$f":"IF(B57+1>=$J$17,0,L45*(1+Captura!$D$35))","v":0},{"$f":"IF(B57+1>=$J$17,0,M45*(1+Captura!$D$35))","v":0},null,{"$f":"IF(B57=J$17,Captura!$M$29,0)","v":0},{"$f":"SUM(D57:F57,I57:N57)*Captura!$C$19","v":{"$error":"#DIV/0!"}},{"$error":"#DIV/0!"},null,null,6,29,0,null,{"$f":"+V56*Captura!$O$9/12","v":0},0,0,{"$f":"IF(U57=J$17,Captura!$M$33,0)","v":0},null,{"$f":"IF(U57+1>=$J$17,0,AC45*(1+Captura!$D$35))","v":0},{"$f":"IF(U57+1>=$J$17,0,AD45*(1+Captura!$D$35))","v":0},{"$f":"IF(U57+1>=$J$17,0,AE45*(1+Captura!$D$35))","v":0},null,{"$f":"+(W57+AB57+AC57+AD57+AE57+AF57)*Captura!$C$19","v":0},0,null,{"$error":"#DIV/0!"},0]
[null,30,"2028-09-04",{"$f":"IF(B58<J$17,Captura!$M$16,0)+Resumen!$K$29+Resumen!$K$30","v":{"$error":"#DIV/0!"}},null,null,null,0,null,null,{"$f":"IF(B58+1>=$J$17,0,K46*(1+Captura!$D$35))","v":0},{"$f":"IF(B58+1>=$J$17,0,L46*(1+Captura!$D$35))","v":0},{"$f":"IF(B58+1>=$J$17,0,M46*(1+Captura!$D$35))","v":0},null,{"$f":"IF(B58=J$17,Captura!$M$29,0)","v":0},{"$f":"SUM(D58:F58,I58:N58)*Captura!$C$19","v":{"$error":"#DIV/0!"}},{"$error":"#DIV/0!"},null,null,7,30,0,null,{"$f":"+V57*Captura!$O$9/12","v":0},0,0,{"$f":"IF(U58=J$17,Captura!$M$33,0)","v":0},null,{"$f":"IF(U58+1>=$J$17,0,AC46*(1+Captura!$D$35))","v":0},{"$f":"IF(U58+1>=$J$17,0,AD46*(1+Captura!$D$35))","v":0},{"$f":"IF(U58+1>=$J$17,0,AE46*(1+Captura!$D$35))","v":0},null,{"$f":"+(W58+AB58+AC58+AD58+AE58+AF58)*Captura!$C$19","v":0},0,null,{"$error":"#DIV/0!"},0]
[null,31,"2028-10-04",{"$f":"IF(B59<J$17,Captura!$M$16,0)+Resumen!$K$29+Resumen!$K$30","v":{"$error":"#DIV/0!"}},null,null,null,0,null,null,{"$f":"IF(B59+1>=$J$17,0,K47*(1+Captura!$D$35))","v":0},{"$f":"IF(B59+1>=$J$17,0,L47*(1+Captura!$D$35))","v":0},{"$f":"IF(B59+1>=$J$17,0,M47*(1+Captura!$D$35))","v":0},null,{"$f":"IF(B59=J$17,Captura!$M$29,0)","v":0},{"$f":"SUM(D59:F59,I59:N59)*Captura!$C$19","v":{"$error":"#DIV/0!"}},{"$error":"#DIV/0!"},null,null,8,31,0,null,{"$f":"+V58*Captura!$O$9/12","v":0},0,0,{"$f":"IF(U59=J$17,Captura!$M$33,0)","v":0},null,{"$f":"IF(U59+1>=$J$17,0,AC47*(1+Captura!$D$35))","v":0},{"$f":"IF(U59+1>=$J$17,0,AD47*(1+Captura!$D$35))","v":0},{"$f":"IF(U59+1>=$J$17,0,AE47*(1+Captura!$D$35))","v":0},null,{"$f":"+(W59+AB59+AC59+AD59+AE59+AF59)*Captura!$C$19","v":0},0,null,{"$error":"#DIV/0!"},0]
[null,32,"2028-11-04",{"$f":"IF(B60<J$17,Captura!$M$16,0)+Resumen!$K$29+Resumen!$K$30","v":{"$error":"#DIV/0!"}},null,null,null,0,null,null,{"$f":"IF(B60+1>=$J$17,0,K48*(1+Captura!$D$35))","v":0},{"$f":"IF(B60+1>=$J$17,0,L48*(1+Captura!$D$35))","v":0},{"$f":"IF(B60+1>=$J$17,0,M48*(1+Captura!$D$35))","v":0},null,{"$f":"IF(B60=J$17,Captura!$M$29,0)","v":0},{"$f":"SUM(D60:F60,I60:N60)*Captura!$C$19","v":{"$error":"#DIV/0!"}},{"$error":"#DIV/0!"},null,null,9,32,0,null,{"$f":"+V59*Captura!$O$9/12","v":0},0,0,{"$f":"IF(U60=J$17,Captura!$M$33,0)","v":0},null,{"$f":"IF(U60+1>=$J$17,0,AC48*(1+Captura!$D$35))","v":0},{"$f":"IF(U60+1>=$J$17,0,AD48*(1+Captura!$D$35))","v":0},{"$f":"IF(U60+1>=$J$17,0,AE48*(1+Captura!$D$35))","v":0},null,{"$f":"+(W60+AB60+AC60+AD60+AE60+AF60)*Captura!$C$19","v":0},0,null,{"$error":"#DIV/0!"},0]
[null,33,"2028-12-04",{"$f":"IF(B61<J$17,Captura!$M$16,0)+Resumen!$K$29+Resumen!$K$30","v":{"$error":"#DIV/0!"}},null,null,null,0,null,null,{"$f":"IF(B61+1>=$J$17,0,K49*(1+Captura!$D$35))","v":0},{"$f":"IF(B61+1>=$J$17,0,L49*(1+Captura!$D$35))","v":0},{"$f":"IF(B61+1>=$J$17,0,M49*(1+Captura!$D$35))","v":0},null,{"$f":"IF(B61=J$17,Captura!$M$29,0)","v":0},{"$f":"SUM(D61:F61,I61:N61)*Captura!$C$19","v":{"$error":"#DIV/0!"}},{"$error":"#DIV/0!"},null,null,10,33,0,null,{"$f":"+V60*Captura!$O$9/12","v":0},0,0,{"$f":"IF(U61=J$17,Captura!$M$33,0)","v":0},null,{"$f":"IF(U61+1>=$J$17,0,AC49*(1+Captura!$D$35))","v":0},{"$f":"IF(U61+1>=$J$17,0,AD49*(1+Captura!$D$35))","v":0},{"$f":"IF(U61+1>=$J$17,0,AE49*(1+Captura!$D$35))","v":0},null,{"$f":"+(W61+AB61+AC61+AD61+AE61+AF61)*Captura!$C$19","v":0},0,null,{"$error":"#DIV/0!"},0]
[null,34,"2029-01-04",{"$f":"IF(B62<J$17,Captura!$M$16,0)+Resumen!$K$29+Resumen!$K$30","v":{"$error":"#DIV/0!"}},null,null,null,0,null,null,{"$f":"IF(B62+1>=$J$17,0,K50*(1+Captura!$D$35))","v":0},{"$f":"IF(B62+1>=$J$17,0,L50*(1+Captura!$D$35))","v":0},{"$f":"IF(B62+1>=$J$17,0,M50*(1+Captura!$D$35))","v":0},null,{"$f":"IF(B62=J$17,Captura!$M$29,0)","v":0},{"$f":"SUM(D62:F62,I62:N62)*Captura!$C$19","v":{"$error":"#DIV/0!"}},{"$error":"#DIV/0!"},null,null,11,34,0,null,{"$f":"+V61*Captura!$O$9/12","v":0},0,0,{"$f":"IF(U62=J$17,Captura!$M$33,0)","v":0},null,{"$f":"IF(U62+1>=$J$17,0,AC50*(1+Captura!$D$35))","v":0},{"$f":"IF(U62+1>=$J$17,0,AD50*(1+Captura!$D$35))","v":0},{"$f":"IF(U62+1>=$J$17,0,AE50*(1+Captura!$D$35))","v":0},null,{"$f":"+(W62+AB62+AC62+AD62+AE62+AF62)*Captura!$C$19","v":0},0,null,{"$error":"#DIV/0!"},0]
[null,35,"2029-02-04",{"$f":"IF(B63<J$17,Captura!$M$16,0)+Resumen!$K$29+Resumen!$K$30","v":{"$error":"#DIV/0!"}},null,null,null,0,null,null,{"$f":"IF(B63+1>=$J$17,0,K51*(1+Captura!$D$35))","v":0},{"$f":"IF(B63+1>=$J$17,0,L51*(1+Captura!$D$35))","v":0},{"$f":"IF(B63+1>=$J$17,0,M51*(1+Captura!$D$35))","v":0},null,{"$f":"IF(B63=J$17,Captura!$M$29,0)","v":0},{"$f":"SUM(D63:F63,I63:N63)*Captura!$C$19","v":{"$error":"#DIV/0!"}},{"$error":"#DIV/0!"},null,null,12,35,0,null,{"$f":"+V62*Captura!$O$9/12","v":0},0,0,{"$f":"IF(U63=J$17,Captura!$M$33,0)","v":0},null,{"$f":"IF(U63+1>=$J$17,0,AC51*(1+Captura!$D$35))","v":0},{"$f":"IF(U63+1>=$J$17,0,AD51*(1+Captura!$D$35))","v":0},{"$f":"IF(U63+1>=$J$17,0,AE51*(1+Captura!$D$35))","v":0},null,{"$f":"+(W63+AB63+AC63+AD63+AE63+AF63)*Captura!$C$19","v":0},0,null,{"$error":"#DIV/0!"},0]
[null,36,"2029-03-04",{"$f":"IF(B64<J$17,Captura!$M$16,0)","v":0},null,null,null,0,null,null,{"$f":"IF(B64+1>=$J$17,0,K52*(1+Captura!$D$35))","v":0},{"$f":"IF(B64+1>=$J$17,0,L52*(1+Captura!$D$35))","v":0},{"$f":"IF(B64+1>=$J$17,0,M52*(1+Captura!$D$35))","v":0},null,{"$f":"IF(B64=J$17,Captura!$M$29,0)","v":0},{"$f":"SUM(D64:F64,I64:N64)*Captura!$C$19","v":0},0,null,null,1,36,0,null,{"$f":"+V63*Captura!$O$9/12","v":0},0,0,{"$f":"IF(U64=J$17,Captura!$M$33,0)","v":0},null,{"$f":"IF(U64+1>=$J$17,0,AC52*(1+Captura!$D$35))","v":0},{"$f":"IF(U64+1>=$J$17,0,AD52*(1+Captura!$D$35))","v":0},{"$f":"IF(U64+1>=$J$17,0,AE52*(1+Captura!$D$35))","v":0},null,{"$f":"+(W64+AB64+AC64+AD64+AE64+AF64)*Captura!$C$19","v":0},0,null,0,0]
[null,37,"2029-04-04",{"$f":"IF(B65<J$17,Captura!$M$16,0)","v":0},null,null,null,0,null,null,{"$f":"IF(B65+1>=$J$17,0,K53*(1+Captura!$D$35))","v":0},{"$f":"IF(B65+1>=$J$17,0,L53*(1+Captura!$D$35))","v":0},{"$f":"IF(B65+1>=$J$17,0,M53*(1+Captura!$D$35))","v":0},null,{"$f":"IF(B65=J$17,Captura!$M$29,0)","v":0},{"$f":"SUM(D65:F65,I65:N65)*Captura!$C$19","v":0},0,null,null,2,37,0,null,{"$f":"+V64*Captura!$O$9/12","v":0},0,0,{"$f":"IF(U65=J$17,Captura!$M$33,0)","v":0},null,{"$f":"IF(U65+1>=$J$17,0,AC53*(1+Captura!$D$35))","v":0},{"$f":"IF(U65+1>=$J$17,0,AD53*(1+Captura!$D$35))","v":0},{"$f":"IF(U65+1>=$J$17,0,AE53*(1+Captura!$D$35))","v":0},null,{"$f":"+(W65+AB65+AC65+AD65+AE65+AF65)*Captura!$C$19","v":0},0,null,0,0]
[null,38,"2029-05-04",{"$f":"IF(B66<J$17,Captura!$M$16,0)","v":0},null,null,null,0,null,null,{"$f":"IF(B66+1>=$J$17,0,K54*(1+Captura!$D$35))","v":0},{"$f":"IF(B66+1>=$J$17,0,L54*(1+Captura!$D$35))","v":0},{"$f":"IF(B66+1>=$J$17,0,M54*(1+Captura!$D$35))","v":0},null,{"$f":"IF(B66=J$17,Captura!$M$29,0)","v":0},{"$f":"SUM(D66:F66,I66:N66)*Captura!$C$19","v":0},0,null,null,3,38,0,null,{"$f":"+V65*Captura!$O$9/12","v":0},0,0,{"$f":"IF(U66=J$17,Captura!$M$33,0)","v":0},null,{"$f":"IF(U66+1>=$J$17,0,AC54*(1+Captura!$D$35))","v":0},{"$f":"IF(U66+1>=$J$17,0,AD54*(1+Captura!$D$35))","v":0},{"$f":"IF(U66+1>=$J$17,0,AE54*(1+Captura!$D$35))","v":0},null,{"$f":"+(W66+AB66+AC66+AD66+AE66+AF66)*Captura!$C$19","v":0},0,null,0,0]
[null,39,"2029-06-04",{"$f":"IF(B67<J$17,Captura!$M$16,0)","v":0},null,null,null,0,null,null,{"$f":"IF(B67+1>=$J$17,0,K55*(1+Captura!$D$35))","v":0},{"$f":"IF(B67+1>=$J$17,0,L55*(1+Captura!$D$35))","v":0},{"$f":"IF(B67+1>=$J$17,0,M55*(1+Captura!$D$35))","v":0},null,{"$f":"IF(B67=J$17,Captura!$M$29,0)","v":0},{"$f":"SUM(D67:F67,I67:N67)*Captura!$C$19","v":0},0,null,null,4,39,0,null,{"$f":"+V66*Captura!$O$9/12","v":0},0,0,{"$f":"IF(U67=J$17,Captura!$M$33,0)","v":0},null,{"$f":"IF(U67+1>=$J$17,0,AC55*(1+Captura!$D$35))","v":0},{"$f":"IF(U67+1>=$J$17,0,AD55*(1+Captura!$D$35))","v":0},{"$f":"IF(U67+1>=$J$17,0,AE55*(1+Captura!$D$35))","v":0},null,{"$f":"+(W67+AB67+AC67+AD67+AE67+AF67)*Captura!$C$19","v":0},0,null,0,0]
[null,40,"2029-07-04",{"$f":"IF(B68<J$17,Captura!$M$16,0)","v":0},null,null,null,0,null,null,{"$f":"IF(B68+1>=$J$17,0,K56*(1+Captura!$D$35))","v":0},{"$f":"IF(B68+1>=$J$17,0,L56*(1+Captura!$D$35))","v":0},{"$f":"IF(B68+1>=$J$17,0,M56*(1+Captura!$D$35))","v":0},null,{"$f":"IF(B68=J$17,Captura!$M$29,0)","v":0},{"$f":"SUM(D68:F68,I68:N68)*Captura!$C$19","v":0},0,null,null,5,40,0,null,{"$f":"+V67*Captura!$O$9/12","v":0},0,0,{"$f":"IF(U68=J$17,Captura!$M$33,0)","v":0},null,{"$f":"IF(U68+1>=$J$17,0,AC56*(1+Captura!$D$35))","v":0},{"$f":"IF(U68+1>=$J$17,0,AD56*(1+Captura!$D$35))","v":0},{"$f":"IF(U68+1>=$J$17,0,AE56*(1+Captura!$D$35))","v":0},null,{"$f":"+(W68+AB68+AC68+AD68+AE68+AF68)*Captura!$C$19","v":0},0,null,0,0]
[null,41,"2029-08-04",{"$f":"IF(B69<J$17,Captura!$M$16,0)","v":0},null,null,null,0,null,null,{"$f":"IF(B69+1>=$J$17,0,K57*(1+Captura!$D$35))","v":0},{"$f":"IF(B69+1>=$J$17,0,L57*(1+Captura!$D$35))","v":0},{"$f":"IF(B69+1>=$J$17,0,M57*(1+Captura!$D$35))","v":0},null,{"$f":"IF(B69=J$17,Captura!$M$29,0)","v":0},{"$f":"SUM(D69:F69,I69:N69)*Captura!$C$19","v":0},0,null,null,6,41,0,null,{"$f":"+V68*Captura!$O$9/12","v":0},0,0,{"$f":"IF(U69=J$17,Captura!$M$33,0)","v":0},null,{"$f":"IF(U69+1>=$J$17,0,AC57*(1+Captura!$D$35))","v":0},{"$f":"IF(U69+1>=$J$17,0,AD57*(1+Captura!$D$35))","v":0},{"$f":"IF(U69+1>=$J$17,0,AE57*(1+Captura!$D$35))","v":0},null,{"$f":"+(W69+AB69+AC69+AD69+AE69+AF69)*Captura!$C$19","v":0},0,null,0,0]
[null,42,"2029-09-04",{"$f":"IF(B70<J$17,Captura!$M$16,0)","v":0},null,null,null,0,null,null,{"$f":"IF(B70+1>=$J$17,0,K58*(1+Captura!$D$35))","v":0},{"$f":"IF(B70+1>=$J$17,0,L58*(1+Captura!$D$35))","v":0},{"$f":"IF(B70+1>=$J$17,0,M58*(1+Captura!$D$35))","v":0},null,{"$f":"IF(B70=J$17,Captura!$M$29,0)","v":0},{"$f":"SUM(D70:F70,I70:N70)*Captura!$C$19","v":0},0,null,null,7,42,0,null,{"$f":"+V69*Captura!$O$9/12","v":0},0,0,{"$f":"IF(U70=J$17,Captura!$M$33,0)","v":0},null,{"$f":"IF(U70+1>=$J$17,0,AC58*(1+Captura!$D$35))","v":0},{"$f":"IF(U70+1>=$J$17,0,AD58*(1+Captura!$D$35))","v":0},{"$f":"IF(U70+1>=$J$17,0,AE58*(1+Captura!$D$35))","v":0},null,{"$f":"+(W70+AB70+AC70+AD70+AE70+AF70)*Captura!$C$19","v":0},0,null,0,0]
[null,43,"2029-10-04",{"$f":"IF(B71<J$17,Captura!$M$16,0)","v":0},null,null,null,0,null,null,{"$f":"IF(B71+1>=$J$17,0,K59*(1+Captura!$D$35))","v":0},{"$f":"IF(B71+1>=$J$17,0,L59*(1+Captura!$D$35))","v":0},{"$f":"IF(B71+1>=$J$17,0,M59*(1+Captura!$D$35))","v":0},null,{"$f":"IF(B71=J$17,Captura!$M$29,0)","v":0},{"$f":"SUM(D71:F71,I71:N71)*Captura!$C$19","v":0},0,null,null,8,43,0,null,{"$f":"+V70*Captura!$O$9/12","v":0},0,0,{"$f":"IF(U71=J$17,Captura!$M$33,0)","v":0},null,{"$f":"IF(U71+1>=$J$17,0,AC59*(1+Captura!$D$35))","v":0},{"$f":"IF(U71+1>=$J$17,0,AD59*(1+Captura!$D$35))","v":0},{"$f":"IF(U71+1>=$J$17,0,AE59*(1+Captura!$D$35))","v":0},null,{"$f":"+(W71+AB71+AC71+AD71+AE71+AF71)*Captura!$C$19","v":0},0,null,0,0]
[null,44,"2029-11-04",{"$f":"IF(B72<J$17,Captura!$M$16,0)","v":0},null,null,null,0,null,null,{"$f":"IF(B72+1>=$J$17,0,K60*(1+Captura!$D$35))","v":0},{"$f":"IF(B72+1>=$J$17,0,L60*(1+Captura!$D$35))","v":0},{"$f":"IF(B72+1>=$J$17,0,M60*(1+Captura!$D$35))","v":0},null,{"$f":"IF(B72=J$17,Captura!$M$29,0)","v":0},{"$f":"SUM(D72:F72,I72:N72)*Captura!$C$19","v":0},0,null,null,9,44,0,null,{"$f":"+V71*Captura!$O$9/12","v":0},0,0,{"$f":"IF(U72=J$17,Captura!$M$33,0)","v":0},null,{"$f":"IF(U72+1>=$J$17,0,AC60*(1+Captura!$D$35))","v":0},{"$f":"IF(U72+1>=$J$17,0,AD60*(1+Captura!$D$35))","v":0},{"$f":"IF(U72+1>=$J$17,0,AE60*(1+Captura!$D$35))","v":0},null,{"$f":"+(W72+AB72+AC72+AD72+AE72+AF72)*Captura!$C$19","v":0},0,null,0,0]
[null,45,"2029-12-04",{"$f":"IF(B73<J$17,Captura!$M$16,0)","v":0},null,null,null,0,null,null,{"$f":"IF(B73+1>=$J$17,0,K61*(1+Captura!$D$35))","v":0},{"$f":"IF(B73+1>=$J$17,0,L61*(1+Captura!$D$35))","v":0},{"$f":"IF(B73+1>=$J$17,0,M61*(1+Captura!$D$35))","v":0},null,{"$f":"IF(B73=J$17,Captura!$M$29,0)","v":0},{"$f":"SUM(D73:F73,I73:N73)*Captura!$C$19","v":0},0,null,null,10,45,0,null,{"$f":"+V72*Captura!$O$9/12","v":0},0,0,{"$f":"IF(U73=J$17,Captura!$M$33,0)","v":0},null,{"$f":"IF(U73+1>=$J$17,0,AC61*(1+Captura!$D$35))","v":0},{"$f":"IF(U73+1>=$J$17,0,AD61*(1+Captura!$D$35))","v":0},{"$f":"IF(U73+1>=$J$17,0,AE61*(1+Captura!$D$35))","v":0},null,{"$f":"+(W73+AB73+AC73+AD73+AE73+AF73)*Captura!$C$19","v":0},0,null,0,0]
[null,46,"2030-01-04",{"$f":"IF(B74<J$17,Captura!$M$16,0)","v":0},null,null,null,0,null,null,{"$f":"IF(B74+1>=$J$17,0,K62*(1+Captura!$D$35))","v":0},{"$f":"IF(B74+1>=$J$17,0,L62*(1+Captura!$D$35))","v":0},{"$f":"IF(B74+1>=$J$17,0,M62*(1+Captura!$D$35))","v":0},null,{"$f":"IF(B74=J$17,Captura!$M$29,0)","v":0},{"$f":"SUM(D74:F74,I74:N74)*Captura!$C$19","v":0},0,null,null,11,46,0,null,{"$f":"+V73*Captura!$O$9/12","v":0},0,0,{"$f":"IF(U74=J$17,Captura!$M$33,0)","v":0},null,{"$f":"IF(U74+1>=$J$17,0,AC62*(1+Captura!$D$35))","v":0},{"$f":"IF(U74+1>=$J$17,0,AD62*(1+Captura!$D$35))","v":0},{"$f":"IF(U74+1>=$J$17,0,AE62*(1+Captura!$D$35))","v":0},null,{"$f":"+(W74+AB74+AC74+AD74+AE74+AF74)*Captura!$C$19","v":0},0,null,0,0]
[null,47,"2030-02-04",{"$f":"IF(B75<J$17,Captura!$M$16,0)","v":0},null,null,null,0,null,null,{"$f":"IF(B75+1>=$J$17,0,K63*(1+Captura!$D$35))","v":0},{"$f":"IF(B75+1>=$J$17,0,L63*(1+Captura!$D$35))","v":0},{"$f":"IF(B75+1>=$J$17,0,M63*(1+Captura!$D$35))","v":0},null,{"$f":"IF(B75=J$17,Captura!$M$29,0)","v":0},{"$f":"SUM(D75:F75,I75:N75)*Captura!$C$19","v":0},0,null,null,12,47,0,null,{"$f":"+V74*Captura!$O$9/12","v":0},0,0,{"$f":"IF(U75=J$17,Captura!$M$33,0)","v":0},null,{"$f":"IF(U75+1>=$J$17,0,AC63*(1+Captura!$D$35))","v":0},{"$f":"IF(U75+1>=$J$17,0,AD63*(1+Captura!$D$35))","v":0},{"$f":"IF(U75+1>=$J$17,0,AE63*(1+Captura!$D$35))","v":0},null,{"$f":"+(W75+AB75+AC75+AD75+AE75+AF75)*Captura!$C$19","v":0},0,null,0,0]
[null,48,"2030-03-04",{"$f":"IF(B76<J$17,Captura!$M$16,0)","v":0},null,null,null,0,null,null,{"$f":"IF(B76+1>=$J$17,0,K64*(1+Captura!$D$35))","v":0},{"$f":"IF(B76+1>=$J$17,0,L64*(1+Captura!$D$35))","v":0},{"$f":"IF(B76+1>=$J$17,0,M64*(1+Captura!$D$35))","v":0},null,{"$f":"IF(B76=J$17,Captura!$M$29,0)","v":0},{"$f":"SUM(D76:F76,I76:N76)*Captura!$C$19","v":0},0,null,null,1,48,0,null,{"$f":"+V75*Captura!$O$9/12","v":0},0,0,{"$f":"IF(U76=J$17,Captura!$M$33,0)","v":0},null,{"$f":"IF(U76+1>=$J$17,0,AC64*(1+Captura!$D$35))","v":0},{"$f":"IF(U76+1>=$J$17,0,AD64*(1+Captura!$D$35))","v":0},{"$f":"IF(U76+1>=$J$17,0,AE64*(1+Captura!$D$35))","v":0},null,{"$f":"+(W76+AB76+AC76+AD76+AE76+AF76)*Captura!$C$19","v":0},0,null,0,0]
[null,49,"2030-04-04",{"$f":"IF(B77<J$17,Captura!$M$16,0)","v":0},null,null,null,0,null,null,{"$f":"IF(B77+1>=$J$17,0,K65*(1+Captura!$D$35))","v":0},{"$f":"IF(B77+1>=$J$17,0,L65*(1+Captura!$D$35))","v":0},{"$f":"IF(B77+1>=$J$17,0,M65*(1+Captura!$D$35))","v":0},null,{"$f":"IF(B77=J$17,Captura!$M$29,0)","v":0},{"$f":"SUM(D77:F77,I77:N77)*Captura!$C$19","v":0},0,null,null,2,49,0,null,{"$f":"+V76*Captura!$O$9/12","v":0},0,0,{"$f":"IF(U77=J$17,Captura!$M$33,0)","v":0},null,{"$f":"IF(U77+1>=$J$17,0,AC65*(1+Captura!$D$35))","v":0},{"$f":"IF(U77+1>=$J$17,0,AD65*(1+Captura!$D$35))","v":0},{"$f":"IF(U77+1>=$J$17,0,AE65*(1+Captura!$D$35))","v":0},null,{"$f":"+(W77+AB77+AC77+AD77+AE77+AF77)*Captura!$C$19","v":0},0,null,0,0]
[null,50,"2030-05-04",{"$f":"IF(B78<J$17,Captura!$M$16,0)","v":0},null,null,null,0,null,null,{"$f":"IF(B78+1>=$J$17,0,K66*(1+Captura!$D$35))","v":0},{"$f":"IF(B78+1>=$J$17,0,L66*(1+Captura!$D$35))","v":0},{"$f":"IF(B78+1>=$J$17,0,M66*(1+Captura!$D$35))","v":0},null,{"$f":"IF(B78=J$17,Captura!$M$29,0)","v":0},{"$f":"SUM(D78:F78,I78:N78)*Captura!$C$19","v":0},0,null,null,3,50,0,null,{"$f":"+V77*Captura!$O$9/12","v":0},0,0,{"$f":"IF(U78=J$17,Captura!$M$33,0)","v":0},null,{"$f":"IF(U78+1>=$J$17,0,AC66*(1+Captura!$D$35))","v":0},{"$f":"IF(U78+1>=$J$17,0,AD66*(1+Captura!$D$35))","v":0},{"$f":"IF(U78+1>=$J$17,0,AE66*(1+Captura!$D$35))","v":0},null,{"$f":"+(W78+AB78+AC78+AD78+AE78+AF78)*Captura!$C$19","v":0},0,null,0,0]
[null,51,"2030-06-04",{"$f":"IF(B79<J$17,Captura!$M$16,0)","v":0},null,null,null,0,null,null,{"$f":"IF(B79+1>=$J$17,0,K67*(1+Captura!$D$35))","v":0},{"$f":"IF(B79+1>=$J$17,0,L67*(1+Captura!$D$35))","v":0},{"$f":"IF(B79+1>=$J$17,0,M67*(1+Captura!$D$35))","v":0},null,{"$f":"IF(B79=J$17,Captura!$M$29,0)","v":0},{"$f":"SUM(D79:F79,I79:N79)*Captura!$C$19","v":0},0,null,null,4,51,0,null,{"$f":"+V78*Captura!$O$9/12","v":0},0,0,{"$f":"IF(U79=J$17,Captura!$M$33,0)","v":0},null,{"$f":"IF(U79+1>=$J$17,0,AC67*(1+Captura!$D$35))","v":0},{"$f":"IF(U79+1>=$J$17,0,AD67*(1+Captura!$D$35))","v":0},{"$f":"IF(U79+1>=$J$17,0,AE67*(1+Captura!$D$35))","v":0},null,{"$f":"+(W79+AB79+AC79+AD79+AE79+AF79)*Captura!$C$19","v":0},0,null,0,0]
[null,52,"2030-07-04",{"$f":"IF(B80<J$17,Captura!$M$16,0)","v":0},null,null,null,0,null,null,{"$f":"IF(B80+1>=$J$17,0,K68*(1+Captura!$D$35))","v":0},{"$f":"IF(B80+1>=$J$17,0,L68*(1+Captura!$D$35))","v":0},{"$f":"IF(B80+1>=$J$17,0,M68*(1+Captura!$D$35))","v":0},null,{"$f":"IF(B80=J$17,Captura!$M$29,0)","v":0},{"$f":"SUM(D80:F80,I80:N80)*Captura!$C$19","v":0},0,null,null,5,52,0,null,{"$f":"+V79*Captura!$O$9/12","v":0},0,0,{"$f":"IF(U80=J$17,Captura!$M$33,0)","v":0},null,{"$f":"IF(U80+1>=$J$17,0,AC68*(1+Captura!$D$35))","v":0},{"$f":"IF(U80+1>=$J$17,0,AD68*(1+Captura!$D$35))","v":0},{"$f":"IF(U80+1>=$J$17,0,AE68*(1+Captura!$D$35))","v":0},null,{"$f":"+(W80+AB80+AC80+AD80+AE80+AF80)*Captura!$C$19","v":0},0,null,0,0]
[null,53,"2030-08-04",{"$f":"IF(B81<J$17,Captura!$M$16,0)","v":0},null,null,null,0,null,null,{"$f":"IF(B81+1>=$J$17,0,K69*(1+Captura!$D$35))","v":0},{"$f":"IF(B81+1>=$J$17,0,L69*(1+Captura!$D$35))","v":0},{"$f":"IF(B81+1>=$J$17,0,M69*(1+Captura!$D$35))","v":0},null,{"$f":"IF(B81=J$17,Captura!$M$29,0)","v":0},{"$f":"SUM(D81:F81,I81:N81)*Captura!$C$19","v":0},0,null,null,6,53,0,null,{"$f":"+V80*Captura!$O$9/12","v":0},0,0,{"$f":"IF(U81=J$17,Captura!$M$33,0)","v":0},null,{"$f":"IF(U81+1>=$J$17,0,AC69*(1+Captura!$D$35))","v":0},{"$f":"IF(U81+1>=$J$17,0,AD69*(1+Captura!$D$35))","v":0},{"$f":"IF(U81+1>=$J$17,0,AE69*(1+Captura!$D$35))","v":0},null,{"$f":"+(W81+AB81+AC81+AD81+AE81+AF81)*Captura!$C$19","v":0},0,null,0,0]
[null,54,"2030-09-04",{"$f":"IF(B82<J$17,Captura!$M$16,0)","v":0},null,null,null,0,null,null,{"$f":"IF(B82+1>=$J$17,0,K70*(1+Captura!$D$35))","v":0},{"$f":"IF(B82+1>=$J$17,0,L70*(1+Captura!$D$35))","v":0},{"$f":"IF(B82+1>=$J$17,0,M70*(1+Captura!$D$35))","v":0},null,{"$f":"IF(B82=J$17,Captura!$M$29,0)","v":0},{"$f":"SUM(D82:F82,I82:N82)*Captura!$C$19","v":0},0,null,null,7,54,0,null,{"$f":"+V81*Captura!$O$9/12","v":0},0,0,{"$f":"IF(U82=J$17,Captura!$M$33,0)","v":0},null,{"$f":"IF(U82+1>=$J$17,0,AC70*(1+Captura!$D$35))","v":0},{"$f":"IF(U82+1>=$J$17,0,AD70*(1+Captura!$D$35))","v":0},{"$f":"IF(U82+1>=$J$17,0,AE70*(1+Captura!$D$35))","v":0},null,{"$f":"+(W82+AB82+AC82+AD82+AE82+AF82)*Captura!$C$19","v":0},0,null,0,0]
[null,55,"2030-10-04",{"$f":"IF(B83<J$17,Captura!$M$16,0)","v":0},null,null,null,0,null,null,{"$f":"IF(B83+1>=$J$17,0,K71*(1+Captura!$D$35))","v":0},{"$f":"IF(B83+1>=$J$17,0,L71*(1+Captura!$D$35))","v":0},{"$f":"IF(B83+1>=$J$17,0,M71*(1+Captura!$D$35))","v":0},null,{"$f":"IF(B83=J$17,Captura!$M$29,0)","v":0},{"$f":"SUM(D83:F83,I83:N83)*Captura!$C$19","v":0},0,null,null,8,55,0,null,{"$f":"+V82*Captura!$O$9/12","v":0},0,0,{"$f":"IF(U83=J$17,Captura!$M$33,0)","v":0},null,{"$f":"IF(U83+1>=$J$17,0,AC71*(1+Captura!$D$35))","v":0},{"$f":"IF(U83+1>=$J$17,0,AD71*(1+Captura!$D$35))","v":0},{"$f":"IF(U83+1>=$J$17,0,AE71*(1+Captura!$D$35))","v":0},null,{"$f":"+(W83+AB83+AC83+AD83+AE83+AF83)*Captura!$C$19","v":0},0,null,0,0]
[null,56,"2030-11-04",{"$f":"IF(B84<J$17,Captura!$M$16,0)","v":0},null,null,null,0,null,null,{"$f":"IF(B84+1>=$J$17,0,K72*(1+Captura!$D$35))","v":0},{"$f":"IF(B84+1>=$J$17,0,L72*(1+Captura!$D$35))","v":0},{"$f":"IF(B84+1>=$J$17,0,M72*(1+Captura!$D$35))","v":0},null,{"$f":"IF(B84=J$17,Captura!$M$29,0)","v":0},{"$f":"SUM(D84:F84,I84:N84)*Captura!$C$19","v":0},0,null,null,9,56,0,null,{"$f":"+V83*Captura!$O$9/12","v":0},0,0,{"$f":"IF(U84=J$17,Captura!$M$33,0)","v":0},null,{"$f":"IF(U84+1>=$J$17,0,AC72*(1+Captura!$D$35))","v":0},{"$f":"IF(U84+1>=$J$17,0,AD72*(1+Captura!$D$35))","v":0},{"$f":"IF(U84+1>=$J$17,0,AE72*(1+Captura!$D$35))","v":0},null,{"$f":"+(W84+AB84+AC84+AD84+AE84+AF84)*Captura!$C$19","v":0},0,null,0,0]
[null,57,"2030-12-04",{"$f":"IF(B85<J$17,Captura!$M$16,0)","v":0},null,null,null,0,null,null,{"$f":"IF(B85+1>=$J$17,0,K73*(1+Captura!$D$35))","v":0},{"$f":"IF(B85+1>=$J$17,0,L73*(1+Captura!$D$35))","v":0},{"$f":"IF(B85+1>=$J$17,0,M73*(1+Captura!$D$35))","v":0},null,{"$f":"IF(B85=J$17,Captura!$M$29,0)","v":0},{"$f":"SUM(D85:F85,I85:N85)*Captura!$C$19","v":0},0,null,null,10,57,0,null,{"$f":"+V84*Captura!$O$9/12","v":0},0,0,{"$f":"IF(U85=J$17,Captura!$M$33,0)","v":0},null,{"$f":"IF(U85+1>=$J$17,0,AC73*(1+Captura!$D$35))","v":0},{"$f":"IF(U85+1>=$J$17,0,AD73*(1+Captura!$D$35))","v":0},{"$f":"IF(U85+1>=$J$17,0,AE73*(1+Captura!$D$35))","v":0},null,{"$f":"+(W85+AB85+AC85+AD85+AE85+AF85)*Captura!$C$19","v":0},0,null,0,0]
[null,58,"2031-01-04",{"$f":"IF(B86<J$17,Captura!$M$16,0)","v":0},null,null,null,0,null,null,{"$f":"IF(B86+1>=$J$17,0,K74*(1+Captura!$D$35))","v":0},{"$f":"IF(B86+1>=$J$17,0,L74*(1+Captura!$D$35))","v":0},{"$f":"IF(B86+1>=$J$17,0,M74*(1+Captura!$D$35))","v":0},null,{"$f":"IF(B86=J$17,Captura!$M$29,0)","v":0},{"$f":"SUM(D86:F86,I86:N86)*Captura!$C$19","v":0},0,null,null,11,58,0,null,{"$f":"+V85*Captura!$O$9/12","v":0},0,0,{"$f":"IF(U86=J$17,Captura!$M$33,0)","v":0},null,{"$f":"IF(U86+1>=$J$17,0,AC74*(1+Captura!$D$35))","v":0},{"$f":"IF(U86+1>=$J$17,0,AD74*(1+Captura!$D$35))","v":0},{"$f":"IF(U86+1>=$J$17,0,AE74*(1+Captura!$D$35))","v":0},null,{"$f":"+(W86+AB86+AC86+AD86+AE86+AF86)*Captura!$C$19","v":0},0,null,0,0]
[null,59,"2031-02-04",{"$f":"IF(B87<J$17,Captura!$M$16,0)","v":0},null,null,null,0,null,null,{"$f":"IF(B87+1>=$J$17,0,K75*(1+Captura!$D$35))","v":0},{"$f":"IF(B87+1>=$J$17,0,L75*(1+Captura!$D$35))","v":0},{"$f":"IF(B87+1>=$J$17,0,M75*(1+Captura!$D$35))","v":0},null,{"$f":"IF(B87=J$17,Captura!$M$29,0)","v":0},{"$f":"SUM(D87:F87,I87:N87)*Captura!$C$19","v":0},0,null,null,12,59,0,null,{"$f":"+V86*Captura!$O$9/12","v":0},0,0,{"$f":"IF(U87=J$17,Captura!$M$33,0)","v":0},null,{"$f":"IF(U87+1>=$J$17,0,AC75*(1+Captura!$D$35))","v":0},{"$f":"IF(U87+1>=$J$17,0,AD75*(1+Captura!$D$35))","v":0},{"$f":"IF(U87+1>=$J$17,0,AE75*(1+Captura!$D$35))","v":0},null,{"$f":"+(W87+AB87+AC87+AD87+AE87+AF87)*Captura!$C$19","v":0},0,null,0,0]
[null,60,"2031-03-04",{"$f":"IF(B88<J$17,Captura!$M$16,0)","v":0},null,null,null,0,null,null,{"$f":"IF(B88+1>=$J$17,0,K76*(1+Captura!$D$35))","v":0},{"$f":"IF(B88+1>=$J$17,0,L76*(1+Captura!$D$35))","v":0},{"$f":"IF(B88+1>=$J$17,0,M76*(1+Captura!$D$35))","v":0},null,{"$f":"IF(B88=J$17,Captura!$M$29,0)","v":0},{"$f":"SUM(D88:F88,I88:N88)*Captura!$C$19","v":0},0,null,null,1,60,0,null,{"$f":"+V87*Captura!$O$9/12","v":0},0,0,{"$f":"IF(U88=J$17,Captura!$M$33,0)","v":0},null,{"$f":"IF(U88+1>=$J$17,0,AC76*(1+Captura!$D$35))","v":0},{"$f":"IF(U88+1>=$J$17,0,AD76*(1+Captura!$D$35))","v":0},{"$f":"IF(U88+1>=$J$17,0,AE76*(1+Captura!$D$35))","v":0},null,{"$f":"+(W88+AB88+AC88+AD88+AE88+AF88)*Captura!$C$19","v":0},0,null,0,0]
[]
[]
[]
[null,"Notas:"]
[null,"1. Esta cotización no es una autorización y no representa ninguna obligación para Leasing Mobile de México, S. A. de C. V."]
[null,"2. La información descrita en el presente documento está sujeta a cambios sin previo aviso."]
[null,"3. Esta cotización no considera gastos que el equipo requiera para su adquisición, uso o mantenimiento."]
[null,"4. Las rentas en depósito serán devueltas al cumplimiento de todas las obligaciones contractauales del Arrendatario."]
[]
[]
[]
[]
[]
[]
[]
[]
[]
[]
[null,"__________________________________"]
[null,"Leasing Mobile de Mexico, SA de CV"]
[null,{"$f":"+Captura!D31","v":"xxxx"}]
[null,{"$f":"+Captura!D32","v":"xxxx"}]
[null,{"$f":"+Captura!D33","v":"xxxx"}]

{"sheet":"Plazo 4","index":9,"n_rows":111,"n_cols":37,"rows_kept":111,"cut":false,"hidden":true,"merged":[[112,1,112,17],[22,4,22,5],[23,4,23,5],[106,1,106,16],[107,1,107,16],[108,1,108,16],[109,1,109,16],[16,35,16,36],[17,16,19,16],[18,4,20,5],[18,35,18,36],[110,1,110,16],[21,4,21,5],[12,10,12,16],[14,1,14,16],[3,15,3,16],[6,1,6,16],[7,1,7,16],[9,15,9,16],[11,10,11,16]]}
[]
[]
[]
[]
[]
[]
[null,"Cotización"]
[null,"Arrendamiento Puro"]
[]
[null,null,null,null,null,null,null,null,null,null,null,null,null,null,null,{"$f":"+Captura!N3","v":"2026-03-04"}]
[]
[null,"Cliente:",null,null,{"$f":"+Captura!D7","v":0},null,null,null,null,"Teléfono",{"$f":"+Captura!D9","v":0}]
[null,"Atención:",null,null,{"$f":"+Captura!D8","v":0},null,null,null,null,"E-mail",{"$f":"+Captura!D10","v":0}]
[null,null,null,null,null,null,null,null,null,null,null,null,null,null,null,null,{"$f":"+Captura!O40","v":"v. 20240220"}]
[]
[]
[null,"Tipo de equipo",null,null,{"$f":"+Captura!T7","v":"Vehículo utilitario"},null,null,"Plazo del arrendamiento",null,{"$f":"+Captura!N13","v":48},null,"Gestoría y Registro",null,{"$f":"+Captura!F23","v":"Pago único"},null,null,null,null,null,null,null,null,null,null,null,null,null,null,null,null,null,null,null,null,null,"Valor presente de flujos"]
[null,"Estado del equipo",null,null,{"$f":"+Captura!T17","v":"Nuevo"},null,null,"No. de rentas en depósito",null,{"$f":"+Captura!K8","v":1},null,"Equipo de geolocalizacióon",null,{"$f":"+Captura!F24","v":"Pago único"},null,null,{"$f":"+Captura!N36","v":0},null,null,null,null,null,null,null,null,null,null,null,null,null,null,null,null,null,null,{"$f":"NPV(Captura!$D$35/12,AJ29:AJ88)+AJ28","v":{"$error":"#DIV/0!"}},{"$f":"NPV(Captura!$D$35/12,AK29:AK88)+AK28","v":-1518.3762396101961}]
[null,"Descripción",null,null,{"$f":"+Captura!D15","v":0},null,null,"Comisión de apertura",null,{"$f":"+Captura!K9","v":0.03},null,"Seguro de daños",null,{"$f":"+Captura!T26","v":"Pago en renta"},null,null,null,null,null,null,null,null,null,null,null,null,null,null,null,null,null,null,null,null,null,"Tasa Interna de Retorno"]
[null,null,null,null,null,null,null,"Anticipo",null,{"$f":"+Captura!K10","v":0},null,"Placas y Tenencia",null,{"$f":"+Captura!T33","v":"Pago anual"},null,null,null,null,null,null,null,null,null,null,null,null,null,null,null,null,null,null,null,null,null,{"$f":"IRR(AJ28:AJ88,0.01)*12","v":{"$error":"#VALUE!"}},{"$f":"IRR(AK28:AK88,0.01)*12","v":{"$error":"#DIV/0!"}}]
[null,null,null,null,null,null,null,"Residual estimado",null,"Valor mercado",null,"Servicio de geolocalización",null,{"$f":"+Captura!T40","v":"Pago anual"},null,null,{"$f":"+Captura!N37","v":"Positivo"},null,null,null,null,null,null,null,null,null,null,null,null,null,null,null,null,null,null,"Capital Req.",{"$f":"+Captura!N34","v":0}]
[null,"Valor factura sin IVA",null,null,{"$f":"+Captura!G18","v":0},null,null,null,null,null,null,{"$f":"+Captura!I25","v":"Otro"},null,{"$f":"+Captura!F28","v":0},null,null,null,null,null,null,null,null,null,null,null,null,null,null,null,null,null,null,null,null,null,"VP / CR",{"$f":"+(AJ18+AK18)/AK21","v":{"$error":"#DIV/0!"}}]
[null,"IVA",null,null,{"$f":"+Captura!G19","v":0},null,null,null,null,null,null,null,null,null,null,null,"Regresar"]
[null,"Valor factua con IVA",null,null,{"$f":"+Captura!G20","v":0},null,null,null,null,null,null,null,null,null,null,null,null,null,null,null,null,null,null,null,null,null,null,null,null,null,null,null,null,null,null,"Indicador anualizado",{"$f":"+AK22/J17*12","v":{"$error":"#DIV/0!"}}]
[]
[null,"Periodo","Mes","Renta","Anticipo","Comisión de apertura","Rentas en depósito","Devolución de rentas en depósito","Gestoría y Registro","Equipo de geo localización","Seguro de daños","Placas y Tenencia","Servicio de geo localización",{"$f":"+L22","v":"Otro"},"Residual estimado","IVA","TOTAL",null,null,"Mes","Periodo","Fondeo","Comisión de apertura","Intereses","Capital","Pago","Bullet","Equipo de geo localización","Seguro de daños","Placas y Tenencia","Servicio de geo localización","Otro","IVA","TOTAL",null,"Flujo Activo sin IVA","Flujo Pasivo sin IVA"]
[]
[null,0,{"$f":"+P10","v":"2026-03-04"},{"$f":"+Captura!N16+Resumen!M29+Resumen!L30","v":{"$error":"#DIV/0!"}},{"$f":"+Captura!K10","v":0},{"$f":"+Captura!N18","v":0},{"$f":"+Captura!N19","v":0},{"$f":"IF(B28=J$17,-G$28,0)","v":0},{"$f":"+Captura!N20","v":0},{"$f":"+Captura!N21","v":0},{"$f":"+Captura!N22","v":0},{"$f":"+Captura!N23","v":0},{"$f":"+Captura!N24","v":0},{"$f":"+Captura!N25","v":0},{"$f":"IF(B28=J$17,Captura!$N$29,0)","v":0},{"$f":"SUM(D28:F28,I28:N28)*Captura!$C$19","v":{"$error":"#DIV/0!"}},{"$f":"SUM(D28:P28)-O28","v":{"$error":"#DIV/0!"}},null,null,1,{"$f":"+B28","v":0},{"$f":"+Captura!O8","v":0},{"$f":"+Captura!N31","v":0},null,null,null,null,{"$f":"+J28","v":0},{"$f":"+Captura!G25","v":0},{"$f":"+Captura!G26","v":0},{"$f":"+Captura!G27","v":380},{"$f":"+N28","v":0},{"$f":"+(W28+AB28+AC28+AD28+AE28+AF28)*Captura!$C$19","v":60.800000000000004},{"$f":"SUM(W28,Z28:AG28)","v":440.8},null,{"$f":"-E22+(Q28-P28)+O28","v":{"$error":"#DIV/0!"}},{"$f":"+V28-(AH28-AG28)","v":-380}]
[null,1,{"$f":"EDATE(C28,1)","v":"2026-04-04"},{"$f":"IF(B29<J$17,Captura!$N$16,0)+Resumen!$L$29+Resumen!$L$30","v":{"$error":"#DIV/0!"}},null,null,null,0,null,null,0,0,0,null,{"$f":"IF(B29=J$17,Captura!$N$29,0)","v":0},{"$f":"SUM(D29:F29,I29:N29)*Captura!$C$19","v":{"$error":"#DIV/0!"}},{"$f":"SUM(D29:P29)-O29","v":{"$error":"#DIV/0!"}},null,null,{"$f":"IF(T28=12,1,T28+1)","v":2},{"$f":"+B29","v":1},{"$f":"+V28-Y29-AA29","v":0},null,{"$f":"+V28*Captura!$O$9/12","v":0},{"$f":"+Z29-X29","v":0},{"$f":"+Captura!N30","v":0},{"$f":"IF(U29=J$17,Captura!$N$33,0)","v":0},null,0,0,0,null,{"$f":"+(W29+AB29+AC29+AD29+AE29+AF29)*Captura!$C$19","v":0},{"$f":"SUM(W29,Z29:AG29)","v":0},null,{"$f":"Q29-P29+O29","v":{"$error":"#DIV/0!"}},{"$f":"-(AH29-AG29)","v":0}]
[null,2,{"$f":"EDATE(C29,1)","v":"2026-05-04"},{"$f":"IF(B30<J$17,Captura!$N$16,0)+Resumen!$L$29+Resumen!$L$30","v":{"$error":"#DIV/0!"}},null,null,null,0,null,null,0,0,0,null,{"$f":"IF(B30=J$17,Captura!$N$29,0)","v":0},{"$f":"SUM(D30:F30,I30:N30)*Captura!$C$19","v":{"$error":"#DIV/0!"}},{"$error":"#DIV/0!"},null,null,{"$f":"IF(T29=12,1,T29+1)","v":3},2,{"$f":"+V29-Y30-AA30","v":0},null,{"$f":"+V29*Captura!$O$9/12","v":0},{"$f":"+Z30-X30","v":0},{"$f":"IF(U30>J$17,0,Z29)","v":0},{"$f":"IF(U30=J$17,Captura!$N$33,0)","v":0},null,0,0,0,null,{"$f":"+(W30+AB30+AC30+AD30+AE30+AF30)*Captura!$C$19","v":0},0,null,{"$f":"Q30-P30+O30","v":{"$error":"#DIV/0!"}},{"$f":"-(AH30-AG30)","v":0}]
[null,3,"2026-06-04",{"$f":"IF(B31<J$17,Captura!$N$16,0)+Resumen!$L$29+Resumen!$L$30","v":{"$error":"#DIV/0!"}},null,null,null,0,null,null,0,0,0,null,{"$f":"IF(B31=J$17,Captura!$N$29,0)","v":0},{"$f":"SUM(D31:F31,I31:N31)*Captura!$C$19","v":{"$error":"#DIV/0!"}},{"$error":"#DIV/0!"},null,null,4,3,0,null,{"$f":"+V30*Captura!$O$9/12","v":0},0,{"$f":"IF(U31>J$17,0,Z30)","v":0},{"$f":"IF(U31=J$17,Captura!$N$33,0)","v":0},null,0,0,0,null,{"$f":"+(W31+AB31+AC31+AD31+AE31+AF31)*Captura!$C$19","v":0},0,null,{"$error":"#DIV/0!"},0]
[null,4,"2026-07-04",{"$f":"IF(B32<J$17,Captura!$N$16,0)+Resumen!$L$29+Resumen!$L$30","v":{"$error":"#DIV/0!"}},null,null,null,0,null,null,0,0,0,null,{"$f":"IF(B32=J$17,Captura!$N$29,0)","v":0},{"$f":"SUM(D32:F32,I32:N32)*Captura!$C$19","v":{"$error":"#DIV/0!"}},{"$error":"#DIV/0!"},null,null,5,4,0,null,{"$f":"+V31*Captura!$O$9/12","v":0},0,0,{"$f":"IF(U32=J$17,Captura!$N$33,0)","v":0},null,0,0,0,null,{"$f":"+(W32+AB32+AC32+AD32+AE32+AF32)*Captura!$C$19","v":0},0,null,{"$error":"#DIV/0!"},0]
[null,5,"2026-08-04",{"$f":"IF(B33<J$17,Captura!$N$16,0)+Resumen!$L$29+Resumen!$L$30","v":{"$error":"#DIV/0!"}},null,null,null,0,null,null,0,0,0,null,{"$f":"IF(B33=J$17,Captura!$N$29,0)","v":0},{"$f":"SUM(D33:F33,I33:N33)*Captura!$C$19","v":{"$error":"#DIV/0!"}},{"$error":"#DIV/0!"},null,null,6,5,0,null,{"$f":"+V32*Captura!$O$9/12","v":0},0,0,{"$f":"IF(U33=J$17,Captura!$N$33,0)","v":0},null,0,0,0,null,{"$f":"+(W33+AB33+AC33+AD33+AE33+AF33)*Captura!$C$19","v":0},0,null,{"$error":"#DIV/0!"},0]
[null,6,"2026-09-04",{"$f":"IF(B34<J$17,Captura!$N$16,0)+Resumen!$L$29+Resumen!$L$30","v":{"$error":"#DIV/0!"}},null,null,null,0,null,null,0,0,0,null,{"$f":"IF(B34=J$17,Captura!$N$29,0)","v":0},{"$f":"SUM(D34:F34,I34:N34)*Captura!$C$19","v":{"$error":"#DIV/0!"}},{"$error":"#DIV/0!"},null,null,7,6,0,null,{"$f":"+V33*Captura!$O$9/12","v":0},0,0,{"$f":"IF(U34=J$17,Captura!$N$33,0)","v":0},null,0,0,0,null,{"$f":"+(W34+AB34+AC34+AD34+AE34+AF34)*Captura!$C$19","v":0},0,null,{"$error":"#DIV/0!"},0]
[null,7,"2026-10-04",{"$f":"IF(B35<J$17,Captura!$N$16,0)+Resumen!$L$29+Resumen!$L$30","v":{"$error":"#DIV/0!"}},null,null,null,0,null,null,0,0,0,null,{"$f":"IF(B35=J$17,Captura!$N$29,0)","v":0},{"$f":"SUM(D35:F35,I35:N35)*Captura!$C$19","v":{"$error":"#DIV/0!"}},{"$error":"#DIV/0!"},null,null,8,7,0,null,{"$f":"+V34*Captura!$O$9/12","v":0},0,0,{"$f":"IF(U35=J$17,Captura!$N$33,0)","v":0},null,0,0,0,null,{"$f":"+(W35+AB35+AC35+AD35+AE35+AF35)*Captura!$C$19","v":0},0,null,{"$error":"#DIV/0!"},0]
[null,8,"2026-11-04",{"$f":"IF(B36<J$17,Captura!$N$16,0)+Resumen!$L$29+Resumen!$L$30","v":{"$error":"#DIV/0!"}},null,null,null,0,null,null,0,0,0,null,{"$f":"IF(B36=J$17,Captura!$N$29,0)","v":0},{"$f":"SUM(D36:F36,I36:N36)*Captura!$C$19","v":{"$error":"#DIV/0!"}},{"$error":"#DIV/0!"},null,null,9,8,0,null,{"$f":"+V35*Captura!$O$9/12","v":0},0,0,{"$f":"IF(U36=J$17,Captura!$N$33,0)","v":0},null,0,0,0,null,{"$f":"+(W36+AB36+AC36+AD36+AE36+AF36)*Captura!$C$19","v":0},0,null,{"$error":"#DIV/0!"},0]
[null,9,"2026-12-04",{"$f":"IF(B37<J$17,Captura!$N$16,0)+Resumen!$L$29+Resumen!$L$30","v":{"$error":"#DIV/0!"}},null,null,null,0,null,null,0,0,0,null,{"$f":"IF(B37=J$17,Captura!$N$29,0)","v":0},{"$f":"SUM(D37:F37,I37:N37)*Captura!$C$19","v":{"$error":"#DIV/0!"}},{"$error":"#DIV/0!"},null,null,10,9,0,null,{"$f":"+V36*Captura!$O$9/12","v":0},0,0,{"$f":"IF(U37=J$17,Captura!$N$33,0)","v":0},null,0,0,0,null,{"$f":"+(W37+AB37+AC37+AD37+AE37+AF37)*Captura!$C$19","v":0},0,null,{"$error":"#DIV/0!"},0]
[null,10,"2027-01-04",{"$f":"IF(B38<J$17,Captura!$N$16,0)+Resumen!$L$29+Resumen!$L$30","v":{"$error":"#DIV/0!"}},null,null,null,0,null,null,0,0,0,null,{"$f":"IF(B38=J$17,Captura!$N$29,0)","v":0},{"$f":"SUM(D38:F38,I38:N38)*Captura!$C$19","v":{"$error":"#DIV/0!"}},{"$error":"#DIV/0!"},null,null,11,10,0,null,{"$f":"+V37*Captura!$O$9/12","v":0},0,0,{"$f":"IF(U38=J$17,Captura!$N$33,0)","v":0},null,0,0,0,null,{"$f":"+(W38+AB38+AC38+AD38+AE38+AF38)*Captura!$C$19","v":0},0,null,{"$error":"#DIV/0!"},0]
[null,11,"2027-02-04",{"$f":"IF(B39<J$17,Captura!$N$16,0)+Resumen!$L$29+Resumen!$L$30","v":{"$error":"#DIV/0!"}},null,null,null,0,null,null,0,0,0,null,{"$f":"IF(B39=J$17,Captura!$N$29,0)","v":0},{"$f":"SUM(D39:F39,I39:N39)*Captura!$C$19","v":{"$error":"#DIV/0!"}},{"$error":"#DIV/0!"},null,null,12,11,0,null,{"$f":"+V38*Captura!$O$9/12","v":0},0,0,{"$f":"IF(U39=J$17,Captura!$N$33,0)","v":0},null,0,0,0,null,{"$f":"+(W39+AB39+AC39+AD39+AE39+AF39)*Captura!$C$19","v":0},0,null,{"$error":"#DIV/0!"},0]
[null,12,"2027-03-04",{"$f":"IF(B40<J$17,Captura!$N$16,0)+Resumen!$L$29+Resumen!$L$30","v":{"$error":"#DIV/0!"}},null,null,null,0,null,null,{"$f":"IF(B40+1>=$J$17,0,K28*(1+Captura!$D$35))","v":0},{"$f":"IF(B40+1>=$J$17,0,L28*(1+Captura!$D$35))","v":0},{"$f":"IF(B40+1>=$J$17,0,M28*(1+Captura!$D$35))","v":0},null,{"$f":"IF(B40=J$17,Captura!$N$29,0)","v":0},{"$f":"SUM(D40:F40,I40:N40)*Captura!$C$19","v":{"$error":"#DIV/0!"}},{"$error":"#DIV/0!"},null,null,1,12,0,null,{"$f":"+V39*Captura!$O$9/12","v":0},0,0,{"$f":"IF(U40=J$17,Captura!$N$33,0)","v":0},null,{"$f":"IF(U40+1>=$J$17,0,AC28*(1+Captura!$D$35))","v":0},{"$f":"IF(U40+1>=$J$17,0,AD28*(1+Captura!$D$35))","v":0},{"$f":"IF(U40+1>=$J$17,0,AE28*(1+Captura!$D$35))","v":395.2},null,{"$f":"+(W40+AB40+AC40+AD40+AE40+AF40)*Captura!$C$19","v":63.231999999999999},458.43200000000002,null,{"$error":"#DIV/0!"},-395.20000000000005]
[null,13,"2027-04-04",{"$f":"IF(B41<J$17,Captura!$N$16,0)+Resumen!$L$29+Resumen!$L$30","v":{"$error":"#DIV/0!"}},null,null,null,0,null,null,{"$f":"IF(B41+1>=$J$17,0,K29*(1+Captura!$D$35))","v":0},{"$f":"IF(B41+1>=$J$17,0,L29*(1+Captura!$D$35))","v":0},{"$f":"IF(B41+1>=$J$17,0,M29*(1+Captura!$D$35))","v":0},null,{"$f":"IF(B41=J$17,Captura!$N$29,0)","v":0},{"$f":"SUM(D41:F41,I41:N41)*Captura!$C$19","v":{"$error":"#DIV/0!"}},{"$error":"#DIV/0!"},null,null,2,13,0,null,{"$f":"+V40*Captura!$O$9/12","v":0},0,0,{"$f":"IF(U41=J$17,Captura!$N$33,0)","v":0},null,{"$f":"IF(U41+1>=$J$17,0,AC29*(1+Captura!$D$35))","v":0},{"$f":"IF(U41+1>=$J$17,0,AD29*(1+Captura!$D$35))","v":0},{"$f":"IF(U41+1>=$J$17,0,AE29*(1+Captura!$D$35))","v":0},null,{"$f":"+(W41+AB41+AC41+AD41+AE41+AF41)*Captura!$C$19","v":0},0,null,{"$error":"#DIV/0!"},0]
[null,14,"2027-05-04",{"$f":"IF(B42<J$17,Captura!$N$16,0)+Resumen!$L$29+Resumen!$L$30","v":{"$error":"#DIV/0!"}},null,null,null,0,null,null,{"$f":"IF(B42+1>=$J$17,0,K30*(1+Captura!$D$35))","v":0},{"$f":"IF(B42+1>=$J$17,0,L30*(1+Captura!$D$35))","v":0},{"$f":"IF(B42+1>=$J$17,0,M30*(1+Captura!$D$35))","v":0},null,{"$f":"IF(B42=J$17,Captura!$N$29,0)","v":0},{"$f":"SUM(D42:F42,I42:N42)*Captura!$C$19","v":{"$error":"#DIV/0!"}},{"$error":"#DIV/0!"},null,null,3,14,0,null,{"$f":"+V41*Captura!$O$9/12","v":0},0,0,{"$f":"IF(U42=J$17,Captura!$N$33,0)","v":0},null,{"$f":"IF(U42+1>=$J$17,0,AC30*(1+Captura!$D$35))","v":0},{"$f":"IF(U42+1>=$J$17,0,AD30*(1+Captura!$D$35))","v":0},{"$f":"IF(U42+1>=$J$17,0,AE30*(1+Captura!$D$35))","v":0},null,{"$f":"+(W42+AB42+AC42+AD42+AE42+AF42)*Captura!$C$19","v":0},0,null,{"$error":"#DIV/0!"},0]
[null,15,"2027-06-04",{"$f":"IF(B43<J$17,Captura!$N$16,0)+Resumen!$L$29+Resumen!$L$30","v":{"$error":"#DIV/0!"}},null,null,null,0,null,null,{"$f":"IF(B43+1>=$J$17,0,K31*(1+Captura!$D$35))","v":0},{"$f":"IF(B43+1>=$J$17,0,L31*(1+Captura!$D$35))","v":0},{"$f":"IF(B43+1>=$J$17,0,M31*(1+Captura!$D$35))","v":0},null,{"$f":"IF(B43=J$17,Captura!$N$29,0)","v":0},{"$f":"SUM(D43:F43,I43:N43)*Captura!$C$19","v":{"$error":"#DIV/0!"}},{"$error":"#DIV/0!"},null,null,4,15,0,null,{"$f":"+V42*Captura!$O$9/12","v":0},0,0,{"$f":"IF(U43=J$17,Captura!$N$33,0)","v":0},null,{"$f":"IF(U43+1>=$J$17,0,AC31*(1+Captura!$D$35))","v":0},{"$f":"IF(U43+1>=$J$17,0,AD31*(1+Captura!$D$35))","v":0},{"$f":"IF(U43+1>=$J$17,0,AE31*(1+Captura!$D$35))","v":0},null,{"$f":"+(W43+AB43+AC43+AD43+AE43+AF43)*Captura!$C$19","v":0},0,null,{"$error":"#DIV/0!"},0]
[null,16,"2027-07-04",{"$f":"IF(B44<J$17,Captura!$N$16,0)+Resumen!$L$29+Resumen!$L$30","v":{"$error":"#DIV/0!"}},null,null,null,0,null,null,{"$f":"IF(B44+1>=$J$17,0,K32*(1+Captura!$D$35))","v":0},{"$f":"IF(B44+1>=$J$17,0,L32*(1+Captura!$D$35))","v":0},{"$f":"IF(B44+1>=$J$17,0,M32*(1+Captura!$D$35))","v":0},null,{"$f":"IF(B44=J$17,Captura!$N$29,0)","v":0},{"$f":"SUM(D44:F44,I44:N44)*Captura!$C$19","v":{"$error":"#DIV/0!"}},{"$error":"#DIV/0!"},null,null,5,16,0,null,{"$f":"+V43*Captura!$O$9/12","v":0},0,0,{"$f":"IF(U44=J$17,Captura!$N$33,0)","v":0},null,{"$f":"IF(U44+1>=$J$17,0,AC32*(1+Captura!$D$35))","v":0},{"$f":"IF(U44+1>=$J$17,0,AD32*(1+Captura!$D$35))","v":0},{"$f":"IF(U44+1>=$J$17,0,AE32*(1+Captura!$D$35))","v":0},null,{"$f":"+(W44+AB44+AC44+AD44+AE44+AF44)*Captura!$C$19","v":0},0,null,{"$error":"#DIV/0!"},0]
[null,17,"2027-08-04",{"$f":"IF(B45<J$17,Captura!$N$16,0)+Resumen!$L$29+Resumen!$L$30","v":{"$error":"#DIV/0!"}},null,null,null,0,null,null,{"$f":"IF(B45+1>=$J$17,0,K33*(1+Captura!$D$35))","v":0},{"$f":"IF(B45+1>=$J$17,0,L33*(1+Captura!$D$35))","v":0},{"$f":"IF(B45+1>=$J$17,0,M33*(1+Captura!$D$35))","v":0},null,{"$f":"IF(B45=J$17,Captura!$N$29,0)","v":0},{"$f":"SUM(D45:F45,I45:N45)*Captura!$C$19","v":{"$error":"#DIV/0!"}},{"$error":"#DIV/0!"},null,null,6,17,0,null,{"$f":"+V44*Captura!$O$9/12","v":0},0,0,{"$f":"IF(U45=J$17,Captura!$N$33,0)","v":0},null,{"$f":"IF(U45+1>=$J$17,0,AC33*(1+Captura!$D$35))","v":0},{"$f":"IF(U45+1>=$J$17,0,AD33*(1+Captura!$D$35))","v":0},{"$f":"IF(U45+1>=$J$17,0,AE33*(1+Captura!$D$35))","v":0},null,{"$f":"+(W45+AB45+AC45+AD45+AE45+AF45)*Captura!$C$19","v":0},0,null,{"$error":"#DIV/0!"},0]
[null,18,"2027-09-04",{"$f":"IF(B46<J$17,Captura!$N$16,0)+Resumen!$L$29+Resumen!$L$30","v":{"$error":"#DIV/0!"}},null,null,null,0,null,null,{"$f":"IF(B46+1>=$J$17,0,K34*(1+Captura!$D$35))","v":0},{"$f":"IF(B46+1>=$J$17,0,L34*(1+Captura!$D$35))","v":0},{"$f":"IF(B46+1>=$J$17,0,M34*(1+Captura!$D$35))","v":0},null,{"$f":"IF(B46=J$17,Captura!$N$29,0)","v":0},{"$f":"SUM(D46:F46,I46:N46)*Captura!$C$19","v":{"$error":"#DIV/0!"}},{"$error":"#DIV/0!"},null,null,7,18,0,null,{"$f":"+V45*Captura!$O$9/12","v":0},0,0,{"$f":"IF(U46=J$17,Captura!$N$33,0)","v":0},null,{"$f":"IF(U46+1>=$J$17,0,AC34*(1+Captura!$D$35))","v":0},{"$f":"IF(U46+1>=$J$17,0,AD34*(1+Captura!$D$35))","v":0},{"$f":"IF(U46+1>=$J$17,0,AE34*(1+Captura!$D$35))","v":0},null,{"$f":"+(W46+AB46+AC46+AD46+AE46+AF46)*Captura!$C$19","v":0},0,null,{"$error":"#DIV/0!"},0]
[null,19,"2027-10-04",{"$f":"IF(B47<J$17,Captura!$N$16,0)+Resumen!$L$29+Resumen!$L$30","v":{"$error":"#DIV/0!"}},null,null,null,0,null,null,{"$f":"IF(B47+1>=$J$17,0,K35*(1+Captura!$D$35))","v":0},{"$f":"IF(B47+1>=$J$17,0,L35*(1+Captura!$D$35))","v":0},{"$f":"IF(B47+1>=$J$17,0,M35*(1+Captura!$D$35))","v":0},null,{"$f":"IF(B47=J$17,Captura!$N$29,0)","v":0},{"$f":"SUM(D47:F47,I47:N47)*Captura!$C$19","v":{"$error":"#DIV/0!"}},{"$error":"#DIV/0!"},null,null,8,19,0,null,{"$f":"+V46*Captura!$O$9/12","v":0},0,0,{"$f":"IF(U47=J$17,Captura!$N$33,0)","v":0},null,{"$f":"IF(U47+1>=$J$17,0,AC35*(1+Captura!$D$35))","v":0},{"$f":"IF(U47+1>=$J$17,0,AD35*(1+Captura!$D$35))","v":0},{"$f":"IF(U47+1>=$J$17,0,AE35*(1+Captura!$D$35))","v":0},null,{"$f":"+(W47+AB47+AC47+AD47+AE47+AF47)*Captura!$C$19","v":0},0,null,{"$error":"#DIV/0!"},0]
[null,20,"2027-11-04",{"$f":"IF(B48<J$17,Captura!$N$16,0)+Resumen!$L$29+Resumen!$L$30","v":{"$error":"#DIV/0!"}},null,null,null,0,null,null,{"$f":"IF(B48+1>=$J$17,0,K36*(1+Captura!$D$35))","v":0},{"$f":"IF(B48+1>=$J$17,0,L36*(1+Captura!$D$35))","v":0},{"$f":"IF(B48+1>=$J$17,0,M36*(1+Captura!$D$35))","v":0},null,{"$f":"IF(B48=J$17,Captura!$N$29,0)","v":0},{"$f":"SUM(D48:F48,I48:N48)*Captura!$C$19","v":{"$error":"#DIV/0!"}},{"$error":"#DIV/0!"},null,null,9,20,0,null,{"$f":"+V47*Captura!$O$9/12","v":0},0,0,{"$f":"IF(U48=J$17,Captura!$N$33,0)","v":0},null,{"$f":"IF(U48+1>=$J$17,0,AC36*(1+Captura!$D$35))","v":0},{"$f":"IF(U48+1>=$J$17,0,AD36*(1+Captura!$D$35))","v":0},{"$f":"IF(U48+1>=$J$17,0,AE36*(1+Captura!$D$35))","v":0},null,{"$f":"+(W48+AB48+AC48+AD48+AE48+AF48)*Captura!$C$19","v":0},0,null,{"$error":"#DIV/0!"},0]
[null,21,"2027-12-04",{"$f":"IF(B49<J$17,Captura!$N$16,0)+Resumen!$L$29+Resumen!$L$30","v":{"$error":"#DIV/0!"}},null,null,null,0,null,null,{"$f":"IF(B49+1>=$J$17,0,K37*(1+Captura!$D$35))","v":0},{"$f":"IF(B49+1>=$J$17,0,L37*(1+Captura!$D$35))","v":0},{"$f":"IF(B49+1>=$J$17,0,M37*(1+Captura!$D$35))","v":0},null,{"$f":"IF(B49=J$17,Captura!$N$29,0)","v":0},{"$f":"SUM(D49:F49,I49:N49)*Captura!$C$19","v":{"$error":"#DIV/0!"}},{"$error":"#DIV/0!"},null,null,10,21,0,null,{"$f":"+V48*Captura!$O$9/12","v":0},0,0,{"$f":"IF(U49=J$17,Captura!$N$33,0)","v":0},null,{"$f":"IF(U49+1>=$J$17,0,AC37*(1+Captura!$D$35))","v":0},{"$f":"IF(U49+1>=$J$17,0,AD37*(1+Captura!$D$35))","v":0},{"$f":"IF(U49+1>=$J$17,0,AE37*(1+Captura!$D$35))","v":0},null,{"$f":"+(W49+AB49+AC49+AD49+AE49+AF49)*Captura!$C$19","v":0},0,null,{"$error":"#DIV/0!"},0]
[null,22,"2028-01-04",{"$f":"IF(B50<J$17,Captura!$N$16,0)+Resumen!$L$29+Resumen!$L$30","v":{"$error":"#DIV/0!"}},null,null,null,0,null,null,{"$f":"IF(B50+1>=$J$17,0,K38*(1+Captura!$D$35))","v":0},{"$f":"IF(B50+1>=$J$17,0,L38*(1+Captura!$D$35))","v":0},{"$f":"IF(B50+1>=$J$17,0,M38*(1+Captura!$D$35))","v":0},null,{"$f":"IF(B50=J$17,Captura!$N$29,0)","v":0},{"$f":"SUM(D50:F50,I50:N50)*Captura!$C$19","v":{"$error":"#DIV/0!"}},{"$error":"#DIV/0!"},null,null,11,22,0,null,{"$f":"+V49*Captura!$O$9/12","v":0},0,0,{"$f":"IF(U50=J$17,Captura!$N$33,0)","v":0},null,{"$f":"IF(U50+1>=$J$17,0,AC38*(1+Captura!$D$35))","v":0},{"$f":"IF(U50+1>=$J$17,0,AD38*(1+Captura!$D$35))","v":0},{"$f":"IF(U50+1>=$J$17,0,AE38*(1+Captura!$D$35))","v":0},null,{"$f":"+(W50+AB50+AC50+AD50+AE50+AF50)*Captura!$C$19","v":0},0,null,{"$error":"#DIV/0!"},0]
[null,23,"2028-02-04",{"$f":"IF(B51<J$17,Captura!$N$16,0)+Resumen!$L$29+Resumen!$L$30","v":{"$error":"#DIV/0!"}},null,null,null,0,null,null,{"$f":"IF(B51+1>=$J$17,0,K39*(1+Captura!$D$35))","v":0},{"$f":"IF(B51+1>=$J$17,0,L39*(1+Captura!$D$35))","v":0},{"$f":"IF(B51+1>=$J$17,0,M39*(1+Captura!$D$35))","v":0},null,{"$f":"IF(B51=J$17,Captura!$N$29,0)","v":0},{"$f":"SUM(D51:F51,I51:N51)*Captura!$C$19","v":{"$error":"#DIV/0!"}},{"$error":"#DIV/0!"},null,null,12,23,0,null,{"$f":"+V50*Captura!$O$9/12","v":0},0,0,{"$f":"IF(U51=J$17,Captura!$N$33,0)","v":0},null,{"$f":"IF(U51+1>=$J$17,0,AC39*(1+Captura!$D$35))","v":0},{"$f":"IF(U51+1>=$J$17,0,AD39*(1+Captura!$D$35))","v":0},{"$f":"IF(U51+1>=$J$17,0,AE39*(1+Captura!$D$35))","v":0},null,{"$f":"+(W51+AB51+AC51+AD51+AE51+AF51)*Captura!$C$19","v":0},0,null,{"$error":"#DIV/0!"},0]
[null,24,"2028-03-04",{"$f":"IF(B52<J$17,Captura!$N$16,0)+Resumen!$L$29+Resumen!$L$30","v":{"$error":"#DIV/0!"}},null,null,null,0,null,null,{"$f":"IF(B52+1>=$J$17,0,K40*(1+Captura!$D$35))","v":0},{"$f":"IF(B52+1>=$J$17,0,L40*(1+Captura!$D$35))","v":0},{"$f":"IF(B52+1>=$J$17,0,M40*(1+Captura!$D$35))","v":0},null,{"$f":"IF(B52=J$17,Captura!$N$29,0)","v":0},{"$f":"SUM(D52:F52,I52:N52)*Captura!$C$19","v":{"$error":"#DIV/0!"}},{"$error":"#DIV/0!"},null,null,1,24,0,null,{"$f":"+V51*Captura!$O$9/12","v":0},0,0,{"$f":"IF(U52=J$17,Captura!$N$33,0)","v":0},null,{"$f":"IF(U52+1>=$J$17,0,AC40*(1+Captura!$D$35))","v":0},{"$f":"IF(U52+1>=$J$17,0,AD40*(1+Captura!$D$35))","v":0},{"$f":"IF(U52+1>=$J$17,0,AE40*(1+Captura!$D$35))","v":411.00799999999998},null,{"$f":"+(W52+AB52+AC52+AD52+AE52+AF52)*Captura!$C$19","v":65.761279999999999},476.76927999999998,null,{"$error":"#DIV/0!"},-411.00799999999998]
[null,25,"2028-04-04",{"$f":"IF(B53<J$17,Captura!$N$16,0)+Resumen!$L$29+Resumen!$L$30","v":{"$error":"#DIV/0!"}},null,null,null,0,null,null,{"$f":"IF(B53+1>=$J$17,0,K41*(1+Captura!$D$35))","v":0},{"$f":"IF(B53+1>=$J$17,0,L41*(1+Captura!$D$35))","v":0},{"$f":"IF(B53+1>=$J$17,0,M41*(1+Captura!$D$35))","v":0},null,{"$f":"IF(B53=J$17,Captura!$N$29,0)","v":0},{"$f":"SUM(D53:F53,I53:N53)*Captura!$C$19","v":{"$error":"#DIV/0!"}},{"$error":"#DIV/0!"},null,null,2,25,0,null,{"$f":"+V52*Captura!$O$9/12","v":0},0,0,{"$f":"IF(U53=J$17,Captura!$N$33,0)","v":0},null,{"$f":"IF(U53+1>=$J$17,0,AC41*(1+Captura!$D$35))","v":0},{"$f":"IF(U53+1>=$J$17,0,AD41*(1+Captura!$D$35))","v":0},{"$f":"IF(U53+1>=$J$17,0,AE41*(1+Captura!$D$35))","v":0},null,{"$f":"+(W53+AB53+AC53+AD53+AE53+AF53)*Captura!$C$19","v":0},0,null,{"$error":"#DIV/0!"},0]
[null,26,"2028-05-04",{"$f":"IF(B54<J$17,Captura!$N$16,0)+Resumen!$L$29+Resumen!$L$30","v":{"$error":"#DIV/0!"}},null,null,null,0,null,null,{"$f":"IF(B54+1>=$J$17,0,K42*(1+Captura!$D$35))","v":0},{"$f":"IF(B54+1>=$J$17,0,L42*(1+Captura!$D$35))","v":0},{"$f":"IF(B54+1>=$J$17,0,M42*(1+Captura!$D$35))","v":0},null,{"$f":"IF(B54=J$17,Captura!$N$29,0)","v":0},{"$f":"SUM(D54:F54,I54:N54)*Captura!$C$19","v":{"$error":"#DIV/0!"}},{"$error":"#DIV/0!"},null,null,3,26,0,null,{"$f":"+V53*Captura!$O$9/12","v":0},0,0,{"$f":"IF(U54=J$17,Captura!$N$33,0)","v":0},null,{"$f":"IF(U54+1>=$J$17,0,AC42*(1+Captura!$D$35))","v":0},{"$f":"IF(U54+1>=$J$17,0,AD42*(1+Captura!$D$35))","v":0},{"$f":"IF(U54+1>=$J$17,0,AE42*(1+Captura!$D$35))","v":0},null,{"$f":"+(W54+AB54+AC54+AD54+AE54+AF54)*Captura!$C$19","v":0},0,null,{"$error":"#DIV/0!"},0]
[null,27,"2028-06-04",{"$f":"IF(B55<J$17,Captura!$N$16,0)+Resumen!$L$29+Resumen!$L$30","v":{"$error":"#DIV/0!"}},null,null,null,0,null,null,{"$f":"IF(B55+1>=$J$17,0,K43*(1+Captura!$D$35))","v":0},{"$f":"IF(B55+1>=$J$17,0,L43*(1+Captura!$D$35))","v":0},{"$f":"IF(B55+1>=$J$17,0,M43*(1+Captura!$D$35))","v":0},null,{"$f":"IF(B55=J$17,Captura!$N$29,0)","v":0},{"$f":"SUM(D55:F55,I55:N55)*Captura!$C$19","v":{"$error":"#DIV/0!"}},{"$error":"#DIV/0!"},null,null,4,27,0,null,{"$f":"+V54*Captura!$O$9/12","v":0},0,0,{"$f":"IF(U55=J$17,Captura!$N$33,0)","v":0},null,{"$f":"IF(U55+1>=$J$17,0,AC43*(1+Captura!$D$35))","v":0},{"$f":"IF(U55+1>=$J$17,0,AD43*(1+Captura!$D$35))","v":0},{"$f":"IF(U55+1>=$J$17,0,AE43*(1+Captura!$D$35))","v":0},null,{"$f":"+(W55+AB55+AC55+AD55+AE55+AF55)*Captura!$C$19","v":0},0,null,{"$error":"#DIV/0!"},0]
[null,28,"2028-07-04",{"$f":"IF(B56<J$17,Captura!$N$16,0)+Resumen!$L$29+Resumen!$L$30","v":{"$error":"#DIV/0!"}},null,null,null,0,null,null,{"$f":"IF(B56+1>=$J$17,0,K44*(1+Captura!$D$35))","v":0},{"$f":"IF(B56+1>=$J$17,0,L44*(1+Captura!$D$35))","v":0},{"$f":"IF(B56+1>=$J$17,0,M44*(1+Captura!$D$35))","v":0},null,{"$f":"IF(B56=J$17,Captura!$N$29,0)","v":0},{"$f":"SUM(D56:F56,I56:N56)*Captura!$C$19","v":{"$error":"#DIV/0!"}},{"$error":"#DIV/0!"},null,null,5,28,0,null,{"$f":"+V55*Captura!$O$9/12","v":0},0,0,{"$f":"IF(U56=J$17,Captura!$N$33,0)","v":0},null,{"$f":"IF(U56+1>=$J$17,0,AC44*(1+Captura!$D$35))","v":0},{"$f":"IF(U56+1>=$J$17,0,AD44*(1+Captura!$D$35))","v":0},{"$f":"IF(U56+1>=$J$17,0,AE44*(1+Captura!$D$35))","v":0},null,{"$f":"+(W56+AB56+AC56+AD56+AE56+AF56)*Captura!$C$19","v":0},0,null,{"$error":"#DIV/0!"},0]
[null,29,"2028-08-04",{"$f":"IF(B57<J$17,Captura!$N$16,0)+Resumen!$L$29+Resumen!$L$30","v":{"$error":"#DIV/0!"}},null,null,null,0,null,null,{"$f":"IF(B57+1>=$J$17,0,K45*(1+Captura!$D$35))","v":0},{"$f":"IF(B57+1>=$J$17,0,L45*(1+Captura!$D$35))","v":0},{"$f":"IF(B57+1>=$J$17,0,M45*(1+Captura!$D$35))","v":0},null,{"$f":"IF(B57=J$17,Captura!$N$29,0)","v":0},{"$f":"SUM(D57:F57,I57:N57)*Captura!$C$19","v":{"$error":"#DIV/0!"}},{"$error":"#DIV/0!"},null,null,6,29,0,null,{"$f":"+V56*Captura!$O$9/12","v":0},0,0,{"$f":"IF(U57=J$17,Captura!$N$33,0)","v":0},null,{"$f":"IF(U57+1>=$J$17,0,AC45*(1+Captura!$D$35))","v":0},{"$f":"IF(U57+1>=$J$17,0,AD45*(1+Captura!$D$35))","v":0},{"$f":"IF(U57+1>=$J$17,0,AE45*(1+Captura!$D$35))","v":0},null,{"$f":"+(W57+AB57+AC57+AD57+AE57+AF57)*Captura!$C$19","v":0},0,null,{"$error":"#DIV/0!"},0]
[null,30,"2028-09-04",{"$f":"IF(B58<J$17,Captura!$N$16,0)+Resumen!$L$29+Resumen!$L$30","v":{"$error":"#DIV/0!"}},null,null,null,0,null,null,{"$f":"IF(B58+1>=$J$17,0,K46*(1+Captura!$D$35))","v":0},{"$f":"IF(B58+1>=$J$17,0,L46*(1+Captura!$D$35))","v":0},{"$f":"IF(B58+1>=$J$17,0,M46*(1+Captura!$D$35))","v":0},null,{"$f":"IF(B58=J$17,Captura!$N$29,0)","v":0},{"$f":"SUM(D58:F58,I58:N58)*Captura!$C$19","v":{"$error":"#DIV/0!"}},{"$error":"#DIV/0!"},null,null,7,30,0,null,{"$f":"+V57*Captura!$O$9/12","v":0},0,0,{"$f":"IF(U58=J$17,Captura!$N$33,0)","v":0},null,{"$f":"IF(U58+1>=$J$17,0,AC46*(1+Captura!$D$35))","v":0},{"$f":"IF(U58+1>=$J$17,0,AD46*(1+Captura!$D$35))","v":0},{"$f":"IF(U58+1>=$J$17,0,AE46*(1+Captura!$D$35))","v":0},null,{"$f":"+(W58+AB58+AC58+AD58+AE58+AF58)*Captura!$C$19","v":0},0,null,{"$error":"#DIV/0!"},0]
[null,31,"2028-10-04",{"$f":"IF(B59<J$17,Captura!$N$16,0)+Resumen!$L$29+Resumen!$L$30","v":{"$error":"#DIV/0!"}},null,null,null,0,null,null,{"$f":"IF(B59+1>=$J$17,0,K47*(1+Captura!$D$35))","v":0},{"$f":"IF(B59+1>=$J$17,0,L47*(1+Captura!$D$35))","v":0},{"$f":"IF(B59+1>=$J$17,0,M47*(1+Captura!$D$35))","v":0},null,{"$f":"IF(B59=J$17,Captura!$N$29,0)","v":0},{"$f":"SUM(D59:F59,I59:N59)*Captura!$C$19","v":{"$error":"#DIV/0!"}},{"$error":"#DIV/0!"},null,null,8,31,0,null,{"$f":"+V58*Captura!$O$9/12","v":0},0,0,{"$f":"IF(U59=J$17,Captura!$N$33,0)","v":0},null,{"$f":"IF(U59+1>=$J$17,0,AC47*(1+Captura!$D$35))","v":0},{"$f":"IF(U59+1>=$J$17,0,AD47*(1+Captura!$D$35))","v":0},{"$f":"IF(U59+1>=$J$17,0,AE47*(1+Captura!$D$35))","v":0},null,{"$f":"+(W59+AB59+AC59+AD59+AE59+AF59)*Captura!$C$19","v":0},0,null,{"$error":"#DIV/0!"},0]
[null,32,"2028-11-04",{"$f":"IF(B60<J$17,Captura!$N$16,0)+Resumen!$L$29+Resumen!$L$30","v":{"$error":"#DIV/0!"}},null,null,null,0,null,null,{"$f":"IF(B60+1>=$J$17,0,K48*(1+Captura!$D$35))","v":0},{"$f":"IF(B60+1>=$J$17,0,L48*(1+Captura!$D$35))","v":0},{"$f":"IF(B60+1>=$J$17,0,M48*(1+Captura!$D$35))","v":0},null,{"$f":"IF(B60=J$17,Captura!$N$29,0)","v":0},{"$f":"SUM(D60:F60,I60:N60)*Captura!$C$19","v":{"$error":"#DIV/0!"}},{"$error":"#DIV/0!"},null,null,9,32,0,null,{"$f":"+V59*Captura!$O$9/12","v":0},0,0,{"$f":"IF(U60=J$17,Captura!$N$33,0)","v":0},null,{"$f":"IF(U60+1>=$J$17,0,AC48*(1+Captura!$D$35))","v":0},{"$f":"IF(U60+1>=$J$17,0,AD48*(1+Captura!$D$35))","v":0},{"$f":"IF(U60+1>=$J$17,0,AE48*(1+Captura!$D$35))","v":0},null,{"$f":"+(W60+AB60+AC60+AD60+AE60+AF60)*Captura!$C$19","v":0},0,null,{"$error":"#DIV/0!"},0]
[null,33,"2028-12-04",{"$f":"IF(B61<J$17,Captura!$N$16,0)+Resumen!$L$29+Resumen!$L$30","v":{"$error":"#DIV/0!"}},null,null,null,0,null,null,{"$f":"IF(B61+1>=$J$17,0,K49*(1+Captura!$D$35))","v":0},{"$f":"IF(B61+1>=$J$17,0,L49*(1+Captura!$D$35))","v":0},{"$f":"IF(B61+1>=$J$17,0,M49*(1+Captura!$D$35))","v":0},null,{"$f":"IF(B61=J$17,Captura!$N$29,0)","v":0},{"$f":"SUM(D61:F61,I61:N61)*Captura!$C$19","v":{"$error":"#DIV/0!"}},{"$error":"#DIV/0!"},null,null,10,33,0,null,{"$f":"+V60*Captura!$O$9/12","v":0},0,0,{"$f":"IF(U61=J$17,Captura!$N$33,0)","v":0},null,{"$f":"IF(U61+1>=$J$17,0,AC49*(1+Captura!$D$35))","v":0},{"$f":"IF(U61+1>=$J$17,0,AD49*(1+Captura!$D$35))","v":0},{"$f":"IF(U61+1>=$J$17,0,AE49*(1+Captura!$D$35))","v":0},null,{"$f":"+(W61+AB61+AC61+AD61+AE61+AF61)*Captura!$C$19","v":0},0,null,{"$error":"#DIV/0!"},0]
[null,34,"2029-01-04",{"$f":"IF(B62<J$17,Captura!$N$16,0)+Resumen!$L$29+Resumen!$L$30","v":{"$error":"#DIV/0!"}},null,null,null,0,null,null,{"$f":"IF(B62+1>=$J$17,0,K50*(1+Captura!$D$35))","v":0},{"$f":"IF(B62+1>=$J$17,0,L50*(1+Captura!$D$35))","v":0},{"$f":"IF(B62+1>=$J$17,0,M50*(1+Captura!$D$35))","v":0},null,{"$f":"IF(B62=J$17,Captura!$N$29,0)","v":0},{"$f":"SUM(D62:F62,I62:N62)*Captura!$C$19","v":{"$error":"#DIV/0!"}},{"$error":"#DIV/0!"},null,null,11,34,0,null,{"$f":"+V61*Captura!$O$9/12","v":0},0,0,{"$f":"IF(U62=J$17,Captura!$N$33,0)","v":0},null,{"$f":"IF(U62+1>=$J$17,0,AC50*(1+Captura!$D$35))","v":0},{"$f":"IF(U62+1>=$J$17,0,AD50*(1+Captura!$D$35))","v":0},{"$f":"IF(U62+1>=$J$17,0,AE50*(1+Captura!$D$35))","v":0},null,{"$f":"+(W62+AB62+AC62+AD62+AE62+AF62)*Captura!$C$19","v":0},0,null,{"$error":"#DIV/0!"},0]
[null,35,"2029-02-04",{"$f":"IF(B63<J$17,Captura!$N$16,0)+Resumen!$L$29+Resumen!$L$30","v":{"$error":"#DIV/0!"}},null,null,null,0,null,null,{"$f":"IF(B63+1>=$J$17,0,K51*(1+Captura!$D$35))","v":0},{"$f":"IF(B63+1>=$J$17,0,L51*(1+Captura!$D$35))","v":0},{"$f":"IF(B63+1>=$J$17,0,M51*(1+Captura!$D$35))","v":0},null,{"$f":"IF(B63=J$17,Captura!$N$29,0)","v":0},{"$f":"SUM(D63:F63,I63:N63)*Captura!$C$19","v":{"$error":"#DIV/0!"}},{"$error":"#DIV/0!"},null,null,12,35,0,null,{"$f":"+V62*Captura!$O$9/12","v":0},0,0,{"$f":"IF(U63=J$17,Captura!$N$33,0)","v":0},null,{"$f":"IF(U63+1>=$J$17,0,AC51*(1+Captura!$D$35))","v":0},{"$f":"IF(U63+1>=$J$17,0,AD51*(1+Captura!$D$35))","v":0},{"$f":"IF(U63+1>=$J$17,0,AE51*(1+Captura!$D$35))","v":0},null,{"$f":"+(W63+AB63+AC63+AD63+AE63+AF63)*Captura!$C$19","v":0},0,null,{"$error":"#DIV/0!"},0]
[null,36,"2029-03-04",{"$f":"IF(B64<J$17,Captura!$N$16,0)+Resumen!$L$29+Resumen!$L$30","v":{"$error":"#DIV/0!"}},null,null,null,0,null,null,{"$f":"IF(B64+1>=$J$17,0,K52*(1+Captura!$D$35))","v":0},{"$f":"IF(B64+1>=$J$17,0,L52*(1+Captura!$D$35))","v":0},{"$f":"IF(B64+1>=$J$17,0,M52*(1+Captura!$D$35))","v":0},null,{"$f":"IF(B64=J$17,Captura!$N$29,0)","v":0},{"$f":"SUM(D64:F64,I64:N64)*Captura!$C$19","v":{"$error":"#DIV/0!"}},{"$error":"#DIV/0!"},null,null,1,36,0,null,{"$f":"+V63*Captura!$O$9/12","v":0},0,0,{"$f":"IF(U64=J$17,Captura!$N$33,0)","v":0},null,{"$f":"IF(U64+1>=$J$17,0,AC52*(1+Captura!$D$35))","v":0},{"$f":"IF(U64+1>=$J$17,0,AD52*(1+Captura!$D$35))","v":0},{"$f":"IF(U64+1>=$J$17,0,AE52*(1+Captura!$D$35))","v":427.44831999999997},null,{"$f":"+(W64+AB64+AC64+AD64+AE64+AF64)*Captura!$C$19","v":68.391731199999995},495.84005119999995,null,{"$error":"#DIV/0!"},-427.44831999999997]
[null,37,"2029-04-04",{"$f":"IF(B65<J$17,Captura!$N$16,0)+Resumen!$L$29+Resumen!$L$30","v":{"$error":"#DIV/0!"}},null,null,null,0,null,null,{"$f":"IF(B65+1>=$J$17,0,K53*(1+Captura!$D$35))","v":0},{"$f":"IF(B65+1>=$J$17,0,L53*(1+Captura!$D$35))","v":0},{"$f":"IF(B65+1>=$J$17,0,M53*(1+Captura!$D$35))","v":0},null,{"$f":"IF(B65=J$17,Captura!$N$29,0)","v":0},{"$f":"SUM(D65:F65,I65:N65)*Captura!$C$19","v":{"$error":"#DIV/0!"}},{"$error":"#DIV/0!"},null,null,2,37,0,null,{"$f":"+V64*Captura!$O$9/12","v":0},0,0,{"$f":"IF(U65=J$17,Captura!$N$33,0)","v":0},null,{"$f":"IF(U65+1>=$J$17,0,AC53*(1+Captura!$D$35))","v":0},{"$f":"IF(U65+1>=$J$17,0,AD53*(1+Captura!$D$35))","v":0},{"$f":"IF(U65+1>=$J$17,0,AE53*(1+Captura!$D$35))","v":0},null,{"$f":"+(W65+AB65+AC65+AD65+AE65+AF65)*Captura!$C$19","v":0},0,null,{"$error":"#DIV/0!"},0]
[null,38,"2029-05-04",{"$f":"IF(B66<J$17,Captura!$N$16,0)+Resumen!$L$29+Resumen!$L$30","v":{"$error":"#DIV/0!"}},null,null,null,0,null,null,{"$f":"IF(B66+1>=$J$17,0,K54*(1+Captura!$D$35))","v":0},{"$f":"IF(B66+1>=$J$17,0,L54*(1+Captura!$D$35))","v":0},{"$f":"IF(B66+1>=$J$17,0,M54*(1+Captura!$D$35))","v":0},null,{"$f":"IF(B66=J$17,Captura!$N$29,0)","v":0},{"$f":"SUM(D66:F66,I66:N66)*Captura!$C$19","v":{"$error":"#DIV/0!"}},{"$error":"#DIV/0!"},null,null,3,38,0,null,{"$f":"+V65*Captura!$O$9/12","v":0},0,0,{"$f":"IF(U66=J$17,Captura!$N$33,0)","v":0},null,{"$f":"IF(U66+1>=$J$17,0,AC54*(1+Captura!$D$35))","v":0},{"$f":"IF(U66+1>=$J$17,0,AD54*(1+Captura!$D$35))","v":0},{"$f":"IF(U66+1>=$J$17,0,AE54*(1+Captura!$D$35))","v":0},null,{"$f":"+(W66+AB66+AC66+AD66+AE66+AF66)*Captura!$C$19","v":0},0,null,{"$error":"#DIV/0!"},0]
[null,39,"2029-06-04",{"$f":"IF(B67<J$17,Captura!$N$16,0)+Resumen!$L$29+Resumen!$L$30","v":{"$error":"#DIV/0!"}},null,null,null,0,null,null,{"$f":"IF(B67+1>=$J$17,0,K55*(1+Captura!$D$35))","v":0},{"$f":"IF(B67+1>=$J$17,0,L55*(1+Captura!$D$35))","v":0},{"$f":"IF(B67+1>=$J$17,0,M55*(1+Captura!$D$35))","v":0},null,{"$f":"IF(B67=J$17,Captura!$N$29,0)","v":0},{"$f":"SUM(D67:F67,I67:N67)*Captura!$C$19","v":{"$error":"#DIV/0!"}},{"$error":"#DIV/0!"},null,null,4,39,0,null,{"$f":"+V66*Captura!$O$9/12","v":0},0,0,{"$f":"IF(U67=J$17,Captura!$N$33,0)","v":0},null,{"$f":"IF(U67+1>=$J$17,0,AC55*(1+Captura!$D$35))","v":0},{"$f":"IF(U67+1>=$J$17,0,AD55*(1+Captura!$D$35))","v":0},{"$f":"IF(U67+1>=$J$17,0,AE55*(1+Captura!$D$35))","v":0},null,{"$f":"+(W67+AB67+AC67+AD67+AE67+AF67)*Captura!$C$19","v":0},0,null,{"$error":"#DIV/0!"},0]
[null,40,"2029-07-04",{"$f":"IF(B68<J$17,Captura!$N$16,0)+Resumen!$L$29+Resumen!$L$30","v":{"$error":"#DIV/0!"}},null,null,null,0,null,null,{"$f":"IF(B68+1>=$J$17,0,K56*(1+Captura!$D$35))","v":0},{"$f":"IF(B68+1>=$J$17,0,L56*(1+Captura!$D$35))","v":0},{"$f":"IF(B68+1>=$J$17,0,M56*(1+Captura!$D$35))","v":0},null,{"$f":"IF(B68=J$17,Captura!$N$29,0)","v":0},{"$f":"SUM(D68:F68,I68:N68)*Captura!$C$19","v":{"$error":"#DIV/0!"}},{"$error":"#DIV/0!"},null,null,5,40,0,null,{"$f":"+V67*Captura!$O$9/12","v":0},0,0,{"$f":"IF(U68=J$17,Captura!$N$33,0)","v":0},null,{"$f":"IF(U68+1>=$J$17,0,AC56*(1+Captura!$D$35))","v":0},{"$f":"IF(U68+1>=$J$17,0,AD56*(1+Captura!$D$35))","v":0},{"$f":"IF(U68+1>=$J$17,0,AE56*(1+Captura!$D$35))","v":0},null,{"$f":"+(W68+AB68+AC68+AD68+AE68+AF68)*Captura!$C$19","v":0},0,null,{"$error":"#DIV/0!"},0]
[null,41,"2029-08-04",{"$f":"IF(B69<J$17,Captura!$N$16,0)+Resumen!$L$29+Resumen!$L$30","v":{"$error":"#DIV/0!"}},null,null,null,0,null,null,{"$f":"IF(B69+1>=$J$17,0,K57*(1+Captura!$D$35))","v":0},{"$f":"IF(B69+1>=$J$17,0,L57*(1+Captura!$D$35))","v":0},{"$f":"IF(B69+1>=$J$17,0,M57*(1+Captura!$D$35))","v":0},null,{"$f":"IF(B69=J$17,Captura!$N$29,0)","v":0},{"$f":"SUM(D69:F69,I69:N69)*Captura!$C$19","v":{"$error":"#DIV/0!"}},{"$error":"#DIV/0!"},null,null,6,41,0,null,{"$f":"+V68*Captura!$O$9/12","v":0},0,0,{"$f":"IF(U69=J$17,Captura!$N$33,0)","v":0},null,{"$f":"IF(U69+1>=$J$17,0,AC57*(1+Captura!$D$35))","v":0},{"$f":"IF(U69+1>=$J$17,0,AD57*(1+Captura!$D$35))","v":0},{"$f":"IF(U69+1>=$J$17,0,AE57*(1+Captura!$D$35))","v":0},null,{"$f":"+(W69+AB69+AC69+AD69+AE69+AF69)*Captura!$C$19","v":0},0,null,{"$error":"#DIV/0!"},0]
[null,42,"2029-09-04",{"$f":"IF(B70<J$17,Captura!$N$16,0)+Resumen!$L$29+Resumen!$L$30","v":{"$error":"#DIV/0!"}},null,null,null,0,null,null,{"$f":"IF(B70+1>=$J$17,0,K58*(1+Captura!$D$35))","v":0},{"$f":"IF(B70+1>=$J$17,0,L58*(1+Captura!$D$35))","v":0},{"$f":"IF(B70+1>=$J$17,0,M58*(1+Captura!$D$35))","v":0},null,{"$f":"IF(B70=J$17,Captura!$N$29,0)","v":0},{"$f":"SUM(D70:F70,I70:N70)*Captura!$C$19","v":{"$error":"#DIV/0!"}},{"$error":"#DIV/0!"},null,null,7,42,0,null,{"$f":"+V69*Captura!$O$9/12","v":0},0,0,{"$f":"IF(U70=J$17,Captura!$N$33,0)","v":0},null,{"$f":"IF(U70+1>=$J$17,0,AC58*(1+Captura!$D$35))","v":0},{"$f":"IF(U70+1>=$J$17,0,AD58*(1+Captura!$D$35))","v":0},{"$f":"IF(U70+1>=$J$17,0,AE58*(1+Captura!$D$35))","v":0},null,{"$f":"+(W70+AB70+AC70+AD70+AE70+AF70)*Captura!$C$19","v":0},0,null,{"$error":"#DIV/0!"},0]
[null,43,"2029-10-04",{"$f":"IF(B71<J$17,Captura!$N$16,0)+Resumen!$L$29+Resumen!$L$30","v":{"$error":"#DIV/0!"}},null,null,null,0,null,null,{"$f":"IF(B71+1>=$J$17,0,K59*(1+Captura!$D$35))","v":0},{"$f":"IF(B71+1>=$J$17,0,L59*(1+Captura!$D$35))","v":0},{"$f":"IF(B71+1>=$J$17,0,M59*(1+Captura!$D$35))","v":0},null,{"$f":"IF(B71=J$17,Captura!$N$29,0)","v":0},{"$f":"SUM(D71:F71,I71:N71)*Captura!$C$19","v":{"$error":"#DIV/0!"}},{"$error":"#DIV/0!"},null,null,8,43,0,null,{"$f":"+V70*Captura!$O$9/12","v":0},0,0,{"$f":"IF(U71=J$17,Captura!$N$33,0)","v":0},null,{"$f":"IF(U71+1>=$J$17,0,AC59*(1+Captura!$D$35))","v":0},{"$f":"IF(U71+1>=$J$17,0,AD59*(1+Captura!$D$35))","v":0},{"$f":"IF(U71+1>=$J$17,0,AE59*(1+Captura!$D$35))","v":0},null,{"$f":"+(W71+AB71+AC71+AD71+AE71+AF71)*Captura!$C$19","v":0},0,null,{"$error":"#DIV/0!"},0]
[null,44,"2029-11-04",{"$f":"IF(B72<J$17,Captura!$N$16,0)+Resumen!$L$29+Resumen!$L$30","v":{"$error":"#DIV/0!"}},null,null,null,0,null,null,{"$f":"IF(B72+1>=$J$17,0,K60*(1+Captura!$D$35))","v":0},{"$f":"IF(B72+1>=$J$17,0,L60*(1+Captura!$D$35))","v":0},{"$f":"IF(B72+1>=$J$17,0,M60*(1+Captura!$D$35))","v":0},null,{"$f":"IF(B72=J$17,Captura!$N$29,0)","v":0},{"$f":"SUM(D72:F72,I72:N72)*Captura!$C$19","v":{"$error":"#DIV/0!"}},{"$error":"#DIV/0!"},null,null,9,44,0,null,{"$f":"+V71*Captura!$O$9/12","v":0},0,0,{"$f":"IF(U72=J$17,Captura!$N$33,0)","v":0},null,{"$f":"IF(U72+1>=$J$17,0,AC60*(1+Captura!$D$35))","v":0},{"$f":"IF(U72+1>=$J$17,0,AD60*(1+Captura!$D$35))","v":0},{"$f":"IF(U72+1>=$J$17,0,AE60*(1+Captura!$D$35))","v":0},null,{"$f":"+(W72+AB72+AC72+AD72+AE72+AF72)*Captura!$C$19","v":0},0,null,{"$error":"#DIV/0!"},0]
[null,45,"2029-12-04",{"$f":"IF(B73<J$17,Captura!$N$16,0)+Resumen!$L$29+Resumen!$L$30","v":{"$error":"#DIV/0!"}},null,null,null,0,null,null,{"$f":"IF(B73+1>=$J$17,0,K61*(1+Captura!$D$35))","v":0},{"$f":"IF(B73+1>=$J$17,0,L61*(1+Captura!$D$35))","v":0},{"$f":"IF(B73+1>=$J$17,0,M61*(1+Captura!$D$35))","v":0},null,{"$f":"IF(B73=J$17,Captura!$N$29,0)","v":0},{"$f":"SUM(D73:F73,I73:N73)*Captura!$C$19","v":{"$error":"#DIV/0!"}},{"$error":"#DIV/0!"},null,null,10,45,0,null,{"$f":"+V72*Captura!$O$9/12","v":0},0,0,{"$f":"IF(U73=J$17,Captura!$N$33,0)","v":0},null,{"$f":"IF(U73+1>=$J$17,0,AC61*(1+Captura!$D$35))","v":0},{"$f":"IF(U73+1>=$J$17,0,AD61*(1+Captura!$D$35))","v":0},{"$f":"IF(U73+1>=$J$17,0,AE61*(1+Captura!$D$35))","v":0},null,{"$f":"+(W73+AB73+AC73+AD73+AE73+AF73)*Captura!$C$19","v":0},0,null,{"$error":"#DIV/0!"},0]
[null,46,"2030-01-04",{"$f":"IF(B74<J$17,Captura!$N$16,0)+Resumen!$L$29+Resumen!$L$30","v":{"$error":"#DIV/0!"}},null,null,null,0,null,null,{"$f":"IF(B74+1>=$J$17,0,K62*(1+Captura!$D$35))","v":0},{"$f":"IF(B74+1>=$J$17,0,L62*(1+Captura!$D$35))","v":0},{"$f":"IF(B74+1>=$J$17,0,M62*(1+Captura!$D$35))","v":0},null,{"$f":"IF(B74=J$17,Captura!$N$29,0)","v":0},{"$f":"SUM(D74:F74,I74:N74)*Captura!$C$19","v":{"$error":"#DIV/0!"}},{"$error":"#DIV/0!"},null,null,11,46,0,null,{"$f":"+V73*Captura!$O$9/12","v":0},0,0,{"$f":"IF(U74=J$17,Captura!$N$33,0)","v":0},null,{"$f":"IF(U74+1>=$J$17,0,AC62*(1+Captura!$D$35))","v":0},{"$f":"IF(U74+1>=$J$17,0,AD62*(1+Captura!$D$35))","v":0},{"$f":"IF(U74+1>=$J$17,0,AE62*(1+Captura!$D$35))","v":0},null,{"$f":"+(W74+AB74+AC74+AD74+AE74+AF74)*Captura!$C$19","v":0},0,null,{"$error":"#DIV/0!"},0]
[null,47,"2030-02-04",{"$f":"IF(B75<J$17,Captura!$N$16,0)+Resumen!$L$29+Resumen!$L$30","v":{"$error":"#DIV/0!"}},null,null,null,0,null,null,{"$f":"IF(B75+1>=$J$17,0,K63*(1+Captura!$D$35))","v":0},{"$f":"IF(B75+1>=$J$17,0,L63*(1+Captura!$D$35))","v":0},{"$f":"IF(B75+1>=$J$17,0,M63*(1+Captura!$D$35))","v":0},null,{"$f":"IF(B75=J$17,Captura!$N$29,0)","v":0},{"$f":"SUM(D75:F75,I75:N75)*Captura!$C$19","v":{"$error":"#DIV/0!"}},{"$error":"#DIV/0!"},null,null,12,47,0,null,{"$f":"+V74*Captura!$O$9/12","v":0},0,0,{"$f":"IF(U75=J$17,Captura!$N$33,0)","v":0},null,{"$f":"IF(U75+1>=$J$17,0,AC63*(1+Captura!$D$35))","v":0},{"$f":"IF(U75+1>=$J$17,0,AD63*(1+Captura!$D$35))","v":0},{"$f":"IF(U75+1>=$J$17,0,AE63*(1+Captura!$D$35))","v":0},null,{"$f":"+(W75+AB75+AC75+AD75+AE75+AF75)*Captura!$C$19","v":0},0,null,{"$error":"#DIV/0!"},0]
[null,48,"2030-03-04",{"$f":"IF(B76<J$17,Captura!$N$16,0)","v":0},null,null,null,0,null,null,{"$f":"IF(B76+1>=$J$17,0,K64*(1+Captura!$D$35))","v":0},{"$f":"IF(B76+1>=$J$17,0,L64*(1+Captura!$D$35))","v":0},{"$f":"IF(B76+1>=$J$17,0,M64*(1+Captura!$D$35))","v":0},null,{"$f":"IF(B76=J$17,Captura!$N$29,0)","v":0},{"$f":"SUM(D76:F76,I76:N76)*Captura!$C$19","v":0},0,null,null,1,48,0,null,{"$f":"+V75*Captura!$O$9/12","v":0},0,0,{"$f":"IF(U76=J$17,Captura!$N$33,0)","v":0},null,{"$f":"IF(U76+1>=$J$17,0,AC64*(1+Captura!$D$35))","v":0},{"$f":"IF(U76+1>=$J$17,0,AD64*(1+Captura!$D$35))","v":0},{"$f":"IF(U76+1>=$J$17,0,AE64*(1+Captura!$D$35))","v":0},null,{"$f":"+(W76+AB76+AC76+AD76+AE76+AF76)*Captura!$C$19","v":0},0,null,0,0]
[null,49,"2030-04-04",{"$f":"IF(B77<J$17,Captura!$N$16,0)","v":0},null,null,null,0,null,null,{"$f":"IF(B77+1>=$J$17,0,K65*(1+Captura!$D$35))","v":0},{"$f":"IF(B77+1>=$J$17,0,L65*(1+Captura!$D$35))","v":0},{"$f":"IF(B77+1>=$J$17,0,M65*(1+Captura!$D$35))","v":0},null,{"$f":"IF(B77=J$17,Captura!$N$29,0)","v":0},{"$f":"SUM(D77:F77,I77:N77)*Captura!$C$19","v":0},0,null,null,2,49,0,null,{"$f":"+V76*Captura!$O$9/12","v":0},0,0,{"$f":"IF(U77=J$17,Captura!$N$33,0)","v":0},null,{"$f":"IF(U77+1>=$J$17,0,AC65*(1+Captura!$D$35))","v":0},{"$f":"IF(U77+1>=$J$17,0,AD65*(1+Captura!$D$35))","v":0},{"$f":"IF(U77+1>=$J$17,0,AE65*(1+Captura!$D$35))","v":0},null,{"$f":"+(W77+AB77+AC77+AD77+AE77+AF77)*Captura!$C$19","v":0},0,null,0,0]
[null,50,"2030-05-04",{"$f":"IF(B78<J$17,Captura!$N$16,0)","v":0},null,null,null,0,null,null,{"$f":"IF(B78+1>=$J$17,0,K66*(1+Captura!$D$35))","v":0},{"$f":"IF(B78+1>=$J$17,0,L66*(1+Captura!$D$35))","v":0},{"$f":"IF(B78+1>=$J$17,0,M66*(1+Captura!$D$35))","v":0},null,{"$f":"IF(B78=J$17,Captura!$N$29,0)","v":0},{"$f":"SUM(D78:F78,I78:N78)*Captura!$C$19","v":0},0,null,null,3,50,0,null,{"$f":"+V77*Captura!$O$9/12","v":0},0,0,{"$f":"IF(U78=J$17,Captura!$N$33,0)","v":0},null,{"$f":"IF(U78+1>=$J$17,0,AC66*(1+Captura!$D$35))","v":0},{"$f":"IF(U78+1>=$J$17,0,AD66*(1+Captura!$D$35))","v":0},{"$f":"IF(U78+1>=$J$17,0,AE66*(1+Captura!$D$35))","v":0},null,{"$f":"+(W78+AB78+AC78+AD78+AE78+AF78)*Captura!$C$19","v":0},0,null,0,0]
[null,51,"2030-06-04",{"$f":"IF(B79<J$17,Captura!$N$16,0)","v":0},null,null,null,0,null,null,{"$f":"IF(B79+1>=$J$17,0,K67*(1+Captura!$D$35))","v":0},{"$f":"IF(B79+1>=$J$17,0,L67*(1+Captura!$D$35))","v":0},{"$f":"IF(B79+1>=$J$17,0,M67*(1+Captura!$D$35))","v":0},null,{"$f":"IF(B79=J$17,Captura!$N$29,0)","v":0},{"$f":"SUM(D79:F79,I79:N79)*Captura!$C$19","v":0},0,null,null,4,51,0,null,{"$f":"+V78*Captura!$O$9/12","v":0},0,0,{"$f":"IF(U79=J$17,Captura!$N$33,0)","v":0},null,{"$f":"IF(U79+1>=$J$17,0,AC67*(1+Captura!$D$35))","v":0},{"$f":"IF(U79+1>=$J$17,0,AD67*(1+Captura!$D$35))","v":0},{"$f":"IF(U79+1>=$J$17,0,AE67*(1+Captura!$D$35))","v":0},null,{"$f":"+(W79+AB79+AC79+AD79+AE79+AF79)*Captura!$C$19","v":0},0,null,0,0]
[null,52,"2030-07-04",{"$f":"IF(B80<J$17,Captura!$N$16,0)","v":0},null,null,null,0,null,null,{"$f":"IF(B80+1>=$J$17,0,K68*(1+Captura!$D$35))","v":0},{"$f":"IF(B80+1>=$J$17,0,L68*(1+Captura!$D$35))","v":0},{"$f":"IF(B80+1>=$J$17,0,M68*(1+Captura!$D$35))","v":0},null,{"$f":"IF(B80=J$17,Captura!$N$29,0)","v":0},{"$f":"SUM(D80:F80,I80:N80)*Captura!$C$19","v":0},0,null,null,5,52,0,null,{"$f":"+V79*Captura!$O$9/12","v":0},0,0,{"$f":"IF(U80=J$17,Captura!$N$33,0)","v":0},null,{"$f":"IF(U80+1>=$J$17,0,AC68*(1+Captura!$D$35))","v":0},{"$f":"IF(U80+1>=$J$17,0,AD68*(1+Captura!$D$35))","v":0},{"$f":"IF(U80+1>=$J$17,0,AE68*(1+Captura!$D$35))","v":0},null,{"$f":"+(W80+AB80+AC80+AD80+AE80+AF80)*Captura!$C$19","v":0},0,null,0,0]
[null,53,"2030-08-04",{"$f":"IF(B81<J$17,Captura!$N$16,0)","v":0},null,null,null,0,null,null,{"$f":"IF(B81+1>=$J$17,0,K69*(1+Captura!$D$35))","v":0},{"$f":"IF(B81+1>=$J$17,0,L69*(1+Captura!$D$35))","v":0},{"$f":"IF(B81+1>=$J$17,0,M69*(1+Captura!$D$35))","v":0},null,{"$f":"IF(B81=J$17,Captura!$N$29,0)","v":0},{"$f":"SUM(D81:F81,I81:N81)*Captura!$C$19","v":0},0,null,null,6,53,0,null,{"$f":"+V80*Captura!$O$9/12","v":0},0,0,{"$f":"IF(U81=J$17,Captura!$N$33,0)","v":0},null,{"$f":"IF(U81+1>=$J$17,0,AC69*(1+Captura!$D$35))","v":0},{"$f":"IF(U81+1>=$J$17,0,AD69*(1+Captura!$D$35))","v":0},{"$f":"IF(U81+1>=$J$17,0,AE69*(1+Captura!$D$35))","v":0},null,{"$f":"+(W81+AB81+AC81+AD81+AE81+AF81)*Captura!$C$19","v":0},0,null,0,0]
[null,54,"2030-09-04",{"$f":"IF(B82<J$17,Captura!$N$16,0)","v":0},null,null,null,0,null,null,{"$f":"IF(B82+1>=$J$17,0,K70*(1+Captura!$D$35))","v":0},{"$f":"IF(B82+1>=$J$17,0,L70*(1+Captura!$D$35))","v":0},{"$f":"IF(B82+1>=$J$17,0,M70*(1+Captura!$D$35))","v":0},null,{"$f":"IF(B82=J$17,Captura!$N$29,0)","v":0},{"$f":"SUM(D82:F82,I82:N82)*Captura!$C$19","v":0},0,null,null,7,54,0,null,{"$f":"+V81*Captura!$O$9/12","v":0},0,0,{"$f":"IF(U82=J$17,Captura!$N$33,0)","v":0},null,{"$f":"IF(U82+1>=$J$17,0,AC70*(1+Captura!$D$35))","v":0},{"$f":"IF(U82+1>=$J$17,0,AD70*(1+Captura!$D$35))","v":0},{"$f":"IF(U82+1>=$J$17,0,AE70*(1+Captura!$D$35))","v":0},null,{"$f":"+(W82+AB82+AC82+AD82+AE82+AF82)*Captura!$C$19","v":0},0,null,0,0]
[null,55,"2030-10-04",{"$f":"IF(B83<J$17,Captura!$N$16,0)","v":0},null,null,null,0,null,null,{"$f":"IF(B83+1>=$J$17,0,K71*(1+Captura!$D$35))","v":0},{"$f":"IF(B83+1>=$J$17,0,L71*(1+Captura!$D$35))","v":0},{"$f":"IF(B83+1>=$J$17,0,M71*(1+Captura!$D$35))","v":0},null,{"$f":"IF(B83=J$17,Captura!$N$29,0)","v":0},{"$f":"SUM(D83:F83,I83:N83)*Captura!$C$19","v":0},0,null,null,8,55,0,null,{"$f":"+V82*Captura!$O$9/12","v":0},0,0,{"$f":"IF(U83=J$17,Captura!$N$33,0)","v":0},null,{"$f":"IF(U83+1>=$J$17,0,AC71*(1+Captura!$D$35))","v":0},{"$f":"IF(U83+1>=$J$17,0,AD71*(1+Captura!$D$35))","v":0},{"$f":"IF(U83+1>=$J$17,0,AE71*(1+Captura!$D$35))","v":0},null,{"$f":"+(W83+AB83+AC83+AD83+AE83+AF83)*Captura!$C$19","v":0},0,null,0,0]
[null,56,"2030-11-04",{"$f":"IF(B84<J$17,Captura!$N$16,0)","v":0},null,null,null,0,null,null,{"$f":"IF(B84+1>=$J$17,0,K72*(1+Captura!$D$35))","v":0},{"$f":"IF(B84+1>=$J$17,0,L72*(1+Captura!$D$35))","v":0},{"$f":"IF(B84+1>=$J$17,0,M72*(1+Captura!$D$35))","v":0},null,{"$f":"IF(B84=J$17,Captura!$N$29,0)","v":0},{"$f":"SUM(D84:F84,I84:N84)*Captura!$C$19","v":0},0,null,null,9,56,0,null,{"$f":"+V83*Captura!$O$9/12","v":0},0,0,{"$f":"IF(U84=J$17,Captura!$N$33,0)","v":0},null,{"$f":"IF(U84+1>=$J$17,0,AC72*(1+Captura!$D$35))","v":0},{"$f":"IF(U84+1>=$J$17,0,AD72*(1+Captura!$D$35))","v":0},{"$f":"IF(U84+1>=$J$17,0,AE72*(1+Captura!$D$35))","v":0},null,{"$f":"+(W84+AB84+AC84+AD84+AE84+AF84)*Captura!$C$19","v":0},0,null,0,0]
[null,57,"2030-12-04",{"$f":"IF(B85<J$17,Captura!$N$16,0)","v":0},null,null,null,0,null,null,{"$f":"IF(B85+1>=$J$17,0,K73*(1+Captura!$D$35))","v":0},{"$f":"IF(B85+1>=$J$17,0,L73*(1+Captura!$D$35))","v":0},{"$f":"IF(B85+1>=$J$17,0,M73*(1+Captura!$D$35))","v":0},null,{"$f":"IF(B85=J$17,Captura!$N$29,0)","v":0},{"$f":"SUM(D85:F85,I85:N85)*Captura!$C$19","v":0},0,null,null,10,57,0,null,{"$f":"+V84*Captura!$O$9/12","v":0},0,0,{"$f":"IF(U85=J$17,Captura!$N$33,0)","v":0},null,{"$f":"IF(U85+1>=$J$17,0,AC73*(1+Captura!$D$35))","v":0},{"$f":"IF(U85+1>=$J$17,0,AD73*(1+Captura!$D$35))","v":0},{"$f":"IF(U85+1>=$J$17,0,AE73*(1+Captura!$D$35))","v":0},null,{"$f":"+(W85+AB85+AC85+AD85+AE85+AF85)*Captura!$C$19","v":0},0,null,0,0]
[null,58,"2031-01-04",{"$f":"IF(B86<J$17,Captura!$N$16,0)","v":0},null,null,null,0,null,null,{"$f":"IF(B86+1>=$J$17,0,K74*(1+Captura!$D$35))","v":0},{"$f":"IF(B86+1>=$J$17,0,L74*(1+Captura!$D$35))","v":0},{"$f":"IF(B86+1>=$J$17,0,M74*(1+Captura!$D$35))","v":0},null,{"$f":"IF(B86=J$17,Captura!$N$29,0)","v":0},{"$f":"SUM(D86:F86,I86:N86)*Captura!$C$19","v":0},0,null,null,11,58,0,null,{"$f":"+V85*Captura!$O$9/12","v":0},0,0,{"$f":"IF(U86=J$17,Captura!$N$33,0)","v":0},null,{"$f":"IF(U86+1>=$J$17,0,AC74*(1+Captura!$D$35))","v":0},{"$f":"IF(U86+1>=$J$17,0,AD74*(1+Captura!$D$35))","v":0},{"$f":"IF(U86+1>=$J$17,0,AE74*(1+Captura!$D$35))","v":0},null,{"$f":"+(W86+AB86+AC86+AD86+AE86+AF86)*Captura!$C$19","v":0},0,null,0,0]
[null,59,"2031-02-04",{"$f":"IF(B87<J$17,Captura!$N$16,0)","v":0},null,null,null,0,null,null,{"$f":"IF(B87+1>=$J$17,0,K75*(1+Captura!$D$35))","v":0},{"$f":"IF(B87+1>=$J$17,0,L75*(1+Captura!$D$35))","v":0},{"$f":"IF(B87+1>=$J$17,0,M75*(1+Captura!$D$35))","v":0},null,{"$f":"IF(B87=J$17,Captura!$N$29,0)","v":0},{"$f":"SUM(D87:F87,I87:N87)*Captura!$C$19","v":0},0,null,null,12,59,0,null,{"$f":"+V86*Captura!$O$9/12","v":0},0,0,{"$f":"IF(U87=J$17,Captura!$N$33,0)","v":0},null,{"$f":"IF(U87+1>=$J$17,0,AC75*(1+Captura!$D$35))","v":0},{"$f":"IF(U87+1>=$J$17,0,AD75*(1+Captura!$D$35))","v":0},{"$f":"IF(U87+1>=$J$17,0,AE75*(1+Captura!$D$35))","v":0},null,{"$f":"+(W87+AB87+AC87+AD87+AE87+AF87)*Captura!$C$19","v":0},0,null,0,0]
[null,60,"2031-03-04",{"$f":"IF(B88<J$17,Captura!$N$16,0)","v":0},null,null,null,0,null,null,{"$f":"IF(B88+1>=$J$17,0,K76*(1+Captura!$D$35))","v":0},{"$f":"IF(B88+1>=$J$17,0,L76*(1+Captura!$D$35))","v":0},{"$f":"IF(B88+1>=$J$17,0,M76*(1+Captura!$D$35))","v":0},null,{"$f":"IF(B88=J$17,Captura!$N$29,0)","v":0},{"$f":"SUM(D88:F88,I88:N88)*Captura!$C$19","v":0},0,null,null,1,60,0,null,{"$f":"+V87*Captura!$O$9/12","v":0},0,0,{"$f":"IF(U88=J$17,Captura!$N$33,0)","v":0},null,{"$f":"IF(U88+1>=$J$17,0,AC76*(1+Captura!$D$35))","v":0},{"$f":"IF(U88+1>=$J$17,0,AD76*(1+Captura!$D$35))","v":0},{"$f":"IF(U88+1>=$J$17,0,AE76*(1+Captura!$D$35))","v":0},null,{"$f":"+(W88+AB88+AC88+AD88+AE88+AF88)*Captura!$C$19","v":0},0,null,0,0]
[]
[]
[]
[null,"Notas:"]
[null,"1. Esta cotización no es una autorización y no representa ninguna obligación para Leasing Mobile de México, S. A. de C. V."]
[null,"2. La información descrita en el presente documento está sujeta a cambios sin previo aviso."]
[null,"3. Esta cotización no considera gastos que el equipo requiera para su adquisición, uso o mantenimiento."]
[null,"4. Las rentas en depósito serán devueltas al cumplimiento de todas las obligaciones contractauales del Arrendatario."]
[]
[]
[]
[]
[]
[]
[]
[]
[]
[]
[null,"__________________________________"]
[null,"Leasing Mobile de Mexico, SA de CV"]
[null,{"$f":"+Captura!D31","v":"xxxx"}]
[null,{"$f":"+Captura!D32","v":"xxxx"}]
[null,{"$f":"+Captura!D33","v":"xxxx"}]

{"sheet":"Plazo 5","index":10,"n_rows":111,"n_cols":37,"rows_kept":111,"cut":false,"hidden":true,"merged":[[112,1,112,17],[22,4,22,5],[23,4,23,5],[106,1,106,16],[107,1,107,16],[108,1,108,16],[109,1,109,16],[16,35,16,36],[17,16,19,16],[18,4,20,5],[18,35,18,36],[110,1,110,16],[21,4,21,5],[12,10,12,16],[14,1,14,16],[3,15,3,16],[6,1,6,16],[7,1,7,16],[9,15,9,16],[11,10,11,16]]}
[]
[]
[]
[]
[]
[]
[null,"Cotización"]
[null,"Arrendamiento Puro"]
[]
[null,null,null,null,null,null,null,null,null,null,null,null,null,null,null,{"$f":"+Captura!N3","v":"2026-03-04"}]
[]
[null,"Cliente:",null,null,{"$f":"+Captura!D7","v":0},null,null,null,null,"Teléfono",{"$f":"+Captura!D9","v":0}]
[null,"Atención:",null,null,{"$f":"+Captura!D8","v":0},null,null,null,null,"E-mail",{"$f":"+Captura!D10","v":0}]
[null,null,null,null,null,null,null,null,null,null,null,null,null,null,null,null,{"$f":"+Captura!O40","v":"v. 20240220"}]
[]
[]
[null,"Tipo de equipo",null,null,{"$f":"+Captura!T7","v":"Vehículo utilitario"},null,null,"Plazo del arrendamiento",null,{"$f":"+Captura!O13","v":60},null,"Gestoría y Registro",null,{"$f":"+Captura!F23","v":"Pago único"},null,null,null,null,null,null,null,null,null,null,null,null,null,null,null,null,null,null,null,null,null,"Valor presente de flujos"]
[null,"Estado del equipo",null,null,{"$f":"+Captura!T17","v":"Nuevo"},null,null,"No. de rentas en depósito",null,{"$f":"+Captura!K8","v":1},null,"Equipo de geolocalizacióon",null,{"$f":"+Captura!F24","v":"Pago único"},null,null,{"$f":"+Captura!O36","v":0},null,null,null,null,null,null,null,null,null,null,null,null,null,null,null,null,null,null,{"$f":"NPV(Captura!$D$35/12,AJ29:AJ88)+AJ28","v":{"$error":"#DIV/0!"}},{"$f":"NPV(Captura!$D$35/12,AK29:AK88)+AK28","v":-1897.2943752820918}]
[null,"Descripción",null,null,{"$f":"+Captura!D15","v":0},null,null,"Comisión de apertura",null,{"$f":"+Captura!K9","v":0.03},null,"Seguro de daños",null,{"$f":"+Captura!T26","v":"Pago en renta"},null,null,null,null,null,null,null,null,null,null,null,null,null,null,null,null,null,null,null,null,null,"Tasa Interna de Retorno"]
[null,null,null,null,null,null,null,"Anticipo",null,{"$f":"+Captura!K10","v":0},null,"Placas y Tenencia",null,{"$f":"+Captura!T33","v":"Pago anual"},null,null,null,null,null,null,null,null,null,null,null,null,null,null,null,null,null,null,null,null,null,{"$f":"IRR(AJ28:AJ88,0.01)*12","v":{"$error":"#VALUE!"}},{"$f":"IRR(AK28:AK88,0.01)*12","v":{"$error":"#NUM!"}}]
[null,null,null,null,null,null,null,"Residual estimado",null,"Valor mercado",null,"Servicio de geolocalización",null,{"$f":"+Captura!T40","v":"Pago anual"},null,null,{"$f":"+Captura!O37","v":"Positivo"},null,null,null,null,null,null,null,null,null,null,null,null,null,null,null,null,null,null,"Capital Req.",{"$f":"+Captura!O34","v":0}]
[null,"Valor factura sin IVA",null,null,{"$f":"+Captura!G18","v":0},null,null,null,null,null,null,{"$f":"+Captura!I25","v":"Otro"},null,{"$f":"+Captura!F28","v":0},null,null,null,null,null,null,null,null,null,null,null,null,null,null,null,null,null,null,null,null,null,"VP / CR",{"$f":"+(AJ18+AK18)/AK21","v":{"$error":"#DIV/0!"}}]
[null,"IVA",null,null,{"$f":"+Captura!G19","v":0},null,null,null,null,null,null,null,null,null,null,null,"Regresar"]
[null,"Valor factua con IVA",null,null,{"$f":"+Captura!G20","v":0},null,null,null,null,null,null,null,null,null,null,null,null,null,null,null,null,null,null,null,null,null,null,null,null,null,null,null,null,null,null,"Indicador anualizado",{"$f":"+AK22/J17*12","v":{"$error":"#DIV/0!"}}]
[]
[null,"Periodo","Mes","Renta","Anticipo","Comisión de apertura","Rentas en depósito","Devolución de rentas en depósito","Gestoría y Registro","Equipo de geo localización","Seguro de daños","Placas y Tenencia","Servicio de geo localización",{"$f":"+L22","v":"Otro"},"Residual estimado","IVA","TOTAL",null,null,"Mes","Periodo","Fondeo","Comisión de apertura","Intereses","Capital","Pago","Bullet","Equipo de geo localización","Seguro de daños","Placas y Tenencia","Servicio de geo localización","Otro","IVA","TOTAL",null,"Flujo Activo sin IVA","Flujo Pasivo sin IVA"]
[]
[null,0,{"$f":"+P10","v":"2026-03-04"},{"$f":"+Captura!O16+Resumen!M29+Resumen!M30","v":{"$error":"#DIV/0!"}},{"$f":"+Captura!K10","v":0},{"$f":"+Captura!O18","v":0},{"$f":"+Captura!O19","v":0},{"$f":"IF(B28=J$17,-G$28,0)","v":0},{"$f":"+Captura!O20","v":0},{"$f":"+Captura!O21","v":0},{"$f":"+Captura!O22","v":0},{"$f":"+Captura!O23","v":0},{"$f":"+Captura!O24","v":0},{"$f":"+Captura!O25","v":0},{"$f":"IF(B28=J$17,Captura!$O$29,0)","v":0},{"$f":"SUM(D28:F28,I28:N28)*Captura!$C$19","v":{"$error":"#DIV/0!"}},{"$f":"SUM(D28:P28)-O28","v":{"$error":"#DIV/0!"}},null,null,1,{"$f":"+B28","v":0},{"$f":"+Captura!O8","v":0},{"$f":"+Captura!O31","v":0},null,null,null,null,{"$f":"+J28","v":0},{"$f":"+Captura!G25","v":0},{"$f":"+Captura!G26","v":0},{"$f":"+Captura!G27","v":380},{"$f":"+N28","v":0},{"$f":"+(W28+AB28+AC28+AD28+AE28+AF28)*Captura!$C$19","v":60.800000000000004},{"$f":"SUM(W28,Z28:AG28)","v":440.8},null,{"$f":"-E22+(Q28-P28)+O28","v":{"$error":"#DIV/0!"}},{"$f":"+V28-(AH28-AG28)","v":-380}]
[null,1,{"$f":"EDATE(C28,1)","v":"2026-04-04"},{"$f":"IF(B29<J$17,Captura!$O$16,0)+Resumen!$M$29+Resumen!$M$30","v":{"$error":"#DIV/0!"}},null,null,null,0,null,null,0,0,0,null,{"$f":"IF(B29=J$17,Captura!$O$29,0)","v":0},{"$f":"SUM(D29:F29,I29:N29)*Captura!$C$19","v":{"$error":"#DIV/0!"}},{"$f":"SUM(D29:P29)-O29","v":{"$error":"#DIV/0!"}},null,null,{"$f":"IF(T28=12,1,T28+1)","v":2},{"$f":"+B29","v":1},{"$f":"+V28-Y29-AA29","v":0},null,{"$f":"+V28*Captura!$O$9/12","v":0},{"$f":"+Z29-X29","v":0},{"$f":"+Captura!O30","v":0},{"$f":"IF(U29=J$17,Captura!$O$33,0)","v":0},null,0,0,0,null,{"$f":"+(W29+AB29+AC29+AD29+AE29+AF29)*Captura!$C$19","v":0},{"$f":"SUM(W29,Z29:AG29)","v":0},null,{"$f":"Q29-P29+O29","v":{"$error":"#DIV/0!"}},{"$f":"-(AH29-AG29)","v":0}]
[null,2,{"$f":"EDATE(C29,1)","v":"2026-05-04"},{"$f":"IF(B30<J$17,Captura!$O$16,0)+Resumen!$M$29+Resumen!$M$30","v":{"$error":"#DIV/0!"}},null,null,null,0,null,null,0,0,0,null,{"$f":"IF(B30=J$17,Captura!$O$29,0)","v":0},{"$f":"SUM(D30:F30,I30:N30)*Captura!$C$19","v":{"$error":"#DIV/0!"}},{"$error":"#DIV/0!"},null,null,{"$f":"IF(T29=12,1,T29+1)","v":3},2,{"$f":"+V29-Y30-AA30","v":0},null,{"$f":"+V29*Captura!$O$9/12","v":0},{"$f":"+Z30-X30","v":0},{"$f":"IF(U30>J$17,0,Z29)","v":0},{"$f":"IF(U30=J$17,Captura!$O$33,0)","v":0},null,0,0,0,null,{"$f":"+(W30+AB30+AC30+AD30+AE30+AF30)*Captura!$C$19","v":0},0,null,{"$f":"Q30-P30+O30","v":{"$error":"#DIV/0!"}},{"$f":"-(AH30-AG30)","v":0}]
[null,3,"2026-06-04",{"$f":"IF(B31<J$17,Captura!$O$16,0)+Resumen!$M$29+Resumen!$M$30","v":{"$error":"#DIV/0!"}},null,null,null,0,null,null,0,0,0,null,{"$f":"IF(B31=J$17,Captura!$O$29,0)","v":0},{"$f":"SUM(D31:F31,I31:N31)*Captura!$C$19","v":{"$error":"#DIV/0!"}},{"$error":"#DIV/0!"},null,null,4,3,0,null,{"$f":"+V30*Captura!$O$9/12","v":0},0,{"$f":"IF(U31>J$17,0,Z30)","v":0},{"$f":"IF(U31=J$17,Captura!$O$33,0)","v":0},null,0,0,0,null,{"$f":"+(W31+AB31+AC31+AD31+AE31+AF31)*Captura!$C$19","v":0},0,null,{"$error":"#DIV/0!"},0]
[null,4,"2026-07-04",{"$f":"IF(B32<J$17,Captura!$O$16,0)+Resumen!$M$29+Resumen!$M$30","v":{"$error":"#DIV/0!"}},null,null,null,0,null,null,0,0,0,null,{"$f":"IF(B32=J$17,Captura!$O$29,0)","v":0},{"$f":"SUM(D32:F32,I32:N32)*Captura!$C$19","v":{"$error":"#DIV/0!"}},{"$error":"#DIV/0!"},null,null,5,4,0,null,{"$f":"+V31*Captura!$O$9/12","v":0},0,0,{"$f":"IF(U32=J$17,Captura!$O$33,0)","v":0},null,0,0,0,null,{"$f":"+(W32+AB32+AC32+AD32+AE32+AF32)*Captura!$C$19","v":0},0,null,{"$error":"#DIV/0!"},0]
[null,5,"2026-08-04",{"$f":"IF(B33<J$17,Captura!$O$16,0)+Resumen!$M$29+Resumen!$M$30","v":{"$error":"#DIV/0!"}},null,null,null,0,null,null,0,0,0,null,{"$f":"IF(B33=J$17,Captura!$O$29,0)","v":0},{"$f":"SUM(D33:F33,I33:N33)*Captura!$C$19","v":{"$error":"#DIV/0!"}},{"$error":"#DIV/0!"},null,null,6,5,0,null,{"$f":"+V32*Captura!$O$9/12","v":0},0,0,{"$f":"IF(U33=J$17,Captura!$O$33,0)","v":0},null,0,0,0,null,{"$f":"+(W33+AB33+AC33+AD33+AE33+AF33)*Captura!$C$19","v":0},0,null,{"$error":"#DIV/0!"},0]
[null,6,"2026-09-04",{"$f":"IF(B34<J$17,Captura!$O$16,0)+Resumen!$M$29+Resumen!$M$30","v":{"$error":"#DIV/0!"}},null,null,null,0,null,null,0,0,0,null,{"$f":"IF(B34=J$17,Captura!$O$29,0)","v":0},{"$f":"SUM(D34:F34,I34:N34)*Captura!$C$19","v":{"$error":"#DIV/0!"}},{"$error":"#DIV/0!"},null,null,7,6,0,null,{"$f":"+V33*Captura!$O$9/12","v":0},0,0,{"$f":"IF(U34=J$17,Captura!$O$33,0)","v":0},null,0,0,0,null,{"$f":"+(W34+AB34+AC34+AD34+AE34+AF34)*Captura!$C$19","v":0},0,null,{"$error":"#DIV/0!"},0]
[null,7,"2026-10-04",{"$f":"IF(B35<J$17,Captura!$O$16,0)+Resumen!$M$29+Resumen!$M$30","v":{"$error":"#DIV/0!"}},null,null,null,0,null,null,0,0,0,null,{"$f":"IF(B35=J$17,Captura!$O$29,0)","v":0},{"$f":"SUM(D35:F35,I35:N35)*Captura!$C$19","v":{"$error":"#DIV/0!"}},{"$error":"#DIV/0!"},null,null,8,7,0,null,{"$f":"+V34*Captura!$O$9/12","v":0},0,0,{"$f":"IF(U35=J$17,Captura!$O$33,0)","v":0},null,0,0,0,null,{"$f":"+(W35+AB35+AC35+AD35+AE35+AF35)*Captura!$C$19","v":0},0,null,{"$error":"#DIV/0!"},0]
[null,8,"2026-11-04",{"$f":"IF(B36<J$17,Captura!$O$16,0)+Resumen!$M$29+Resumen!$M$30","v":{"$error":"#DIV/0!"}},null,null,null,0,null,null,0,0,0,null,{"$f":"IF(B36=J$17,Captura!$O$29,0)","v":0},{"$f":"SUM(D36:F36,I36:N36)*Captura!$C$19","v":{"$error":"#DIV/0!"}},{"$error":"#DIV/0!"},null,null,9,8,0,null,{"$f":"+V35*Captura!$O$9/12","v":0},0,0,{"$f":"IF(U36=J$17,Captura!$O$33,0)","v":0},null,0,0,0,null,{"$f":"+(W36+AB36+AC36+AD36+AE36+AF36)*Captura!$C$19","v":0},0,null,{"$error":"#DIV/0!"},0]
[null,9,"2026-12-04",{"$f":"IF(B37<J$17,Captura!$O$16,0)+Resumen!$M$29+Resumen!$M$30","v":{"$error":"#DIV/0!"}},null,null,null,0,null,null,0,0,0,null,{"$f":"IF(B37=J$17,Captura!$O$29,0)","v":0},{"$f":"SUM(D37:F37,I37:N37)*Captura!$C$19","v":{"$error":"#DIV/0!"}},{"$error":"#DIV/0!"},null,null,10,9,0,null,{"$f":"+V36*Captura!$O$9/12","v":0},0,0,{"$f":"IF(U37=J$17,Captura!$O$33,0)","v":0},null,0,0,0,null,{"$f":"+(W37+AB37+AC37+AD37+AE37+AF37)*Captura!$C$19","v":0},0,null,{"$error":"#DIV/0!"},0]
[null,10,"2027-01-04",{"$f":"IF(B38<J$17,Captura!$O$16,0)+Resumen!$M$29+Resumen!$M$30","v":{"$error":"#DIV/0!"}},null,null,null,0,null,null,0,0,0,null,{"$f":"IF(B38=J$17,Captura!$O$29,0)","v":0},{"$f":"SUM(D38:F38,I38:N38)*Captura!$C$19","v":{"$error":"#DIV/0!"}},{"$error":"#DIV/0!"},null,null,11,10,0,null,{"$f":"+V37*Captura!$O$9/12","v":0},0,0,{"$f":"IF(U38=J$17,Captura!$O$33,0)","v":0},null,0,0,0,null,{"$f":"+(W38+AB38+AC38+AD38+AE38+AF38)*Captura!$C$19","v":0},0,null,{"$error":"#DIV/0!"},0]
[null,11,"2027-02-04",{"$f":"IF(B39<J$17,Captura!$O$16,0)+Resumen!$M$29+Resumen!$M$30","v":{"$error":"#DIV/0!"}},null,null,null,0,null,null,0,0,0,null,{"$f":"IF(B39=J$17,Captura!$O$29,0)","v":0},{"$f":"SUM(D39:F39,I39:N39)*Captura!$C$19","v":{"$error":"#DIV/0!"}},{"$error":"#DIV/0!"},null,null,12,11,0,null,{"$f":"+V38*Captura!$O$9/12","v":0},0,0,{"$f":"IF(U39=J$17,Captura!$O$33,0)","v":0},null,0,0,0,null,{"$f":"+(W39+AB39+AC39+AD39+AE39+AF39)*Captura!$C$19","v":0},0,null,{"$error":"#DIV/0!"},0]
[null,12,"2027-03-04",{"$f":"IF(B40<J$17,Captura!$O$16,0)+Resumen!$M$29+Resumen!$M$30","v":{"$error":"#DIV/0!"}},null,null,null,0,null,null,{"$f":"IF(B40+1>=$J$17,0,K28*(1+Captura!$D$35))","v":0},{"$f":"IF(B40+1>=$J$17,0,L28*(1+Captura!$D$35))","v":0},{"$f":"IF(B40+1>=$J$17,0,M28*(1+Captura!$D$35))","v":0},null,{"$f":"IF(B40=J$17,Captura!$O$29,0)","v":0},{"$f":"SUM(D40:F40,I40:N40)*Captura!$C$19","v":{"$error":"#DIV/0!"}},{"$error":"#DIV/0!"},null,null,1,12,0,null,{"$f":"+V39*Captura!$O$9/12","v":0},0,0,{"$f":"IF(U40=J$17,Captura!$O$33,0)","v":0},null,{"$f":"IF(U40+1>=$J$17,0,AC28*(1+Captura!$D$35))","v":0},{"$f":"IF(U40+1>=$J$17,0,AD28*(1+Captura!$D$35))","v":0},{"$f":"IF(U40+1>=$J$17,0,AE28*(1+Captura!$D$35))","v":395.2},null,{"$f":"+(W40+AB40+AC40+AD40+AE40+AF40)*Captura!$C$19","v":63.231999999999999},458.43200000000002,null,{"$error":"#DIV/0!"},-395.20000000000005]
[null,13,"2027-04-04",{"$f":"IF(B41<J$17,Captura!$O$16,0)+Resumen!$M$29+Resumen!$M$30","v":{"$error":"#DIV/0!"}},null,null,null,0,null,null,{"$f":"IF(B41+1>=$J$17,0,K29*(1+Captura!$D$35))","v":0},{"$f":"IF(B41+1>=$J$17,0,L29*(1+Captura!$D$35))","v":0},{"$f":"IF(B41+1>=$J$17,0,M29*(1+Captura!$D$35))","v":0},null,{"$f":"IF(B41=J$17,Captura!$O$29,0)","v":0},{"$f":"SUM(D41:F41,I41:N41)*Captura!$C$19","v":{"$error":"#DIV/0!"}},{"$error":"#DIV/0!"},null,null,2,13,0,null,{"$f":"+V40*Captura!$O$9/12","v":0},0,0,{"$f":"IF(U41=J$17,Captura!$O$33,0)","v":0},null,{"$f":"IF(U41+1>=$J$17,0,AC29*(1+Captura!$D$35))","v":0},{"$f":"IF(U41+1>=$J$17,0,AD29*(1+Captura!$D$35))","v":0},{"$f":"IF(U41+1>=$J$17,0,AE29*(1+Captura!$D$35))","v":0},null,{"$f":"+(W41+AB41+AC41+AD41+AE41+AF41)*Captura!$C$19","v":0},0,null,{"$error":"#DIV/0!"},0]
[null,14,"2027-05-04",{"$f":"IF(B42<J$17,Captura!$O$16,0)+Resumen!$M$29+Resumen!$M$30","v":{"$error":"#DIV/0!"}},null,null,null,0,null,null,{"$f":"IF(B42+1>=$J$17,0,K30*(1+Captura!$D$35))","v":0},{"$f":"IF(B42+1>=$J$17,0,L30*(1+Captura!$D$35))","v":0},{"$f":"IF(B42+1>=$J$17,0,M30*(1+Captura!$D$35))","v":0},null,{"$f":"IF(B42=J$17,Captura!$O$29,0)","v":0},{"$f":"SUM(D42:F42,I42:N42)*Captura!$C$19","v":{"$error":"#DIV/0!"}},{"$error":"#DIV/0!"},null,null,3,14,0,null,{"$f":"+V41*Captura!$O$9/12","v":0},0,0,{"$f":"IF(U42=J$17,Captura!$O$33,0)","v":0},null,{"$f":"IF(U42+1>=$J$17,0,AC30*(1+Captura!$D$35))","v":0},{"$f":"IF(U42+1>=$J$17,0,AD30*(1+Captura!$D$35))","v":0},{"$f":"IF(U42+1>=$J$17,0,AE30*(1+Captura!$D$35))","v":0},null,{"$f":"+(W42+AB42+AC42+AD42+AE42+AF42)*Captura!$C$19","v":0},0,null,{"$error":"#DIV/0!"},0]
[null,15,"2027-06-04",{"$f":"IF(B43<J$17,Captura!$O$16,0)+Resumen!$M$29+Resumen!$M$30","v":{"$error":"#DIV/0!"}},null,null,null,0,null,null,{"$f":"IF(B43+1>=$J$17,0,K31*(1+Captura!$D$35))","v":0},{"$f":"IF(B43+1>=$J$17,0,L31*(1+Captura!$D$35))","v":0},{"$f":"IF(B43+1>=$J$17,0,M31*(1+Captura!$D$35))","v":0},null,{"$f":"IF(B43=J$17,Captura!$O$29,0)","v":0},{"$f":"SUM(D43:F43,I43:N43)*Captura!$C$19","v":{"$error":"#DIV/0!"}},{"$error":"#DIV/0!"},null,null,4,15,0,null,{"$f":"+V42*Captura!$O$9/12","v":0},0,0,{"$f":"IF(U43=J$17,Captura!$O$33,0)","v":0},null,{"$f":"IF(U43+1>=$J$17,0,AC31*(1+Captura!$D$35))","v":0},{"$f":"IF(U43+1>=$J$17,0,AD31*(1+Captura!$D$35))","v":0},{"$f":"IF(U43+1>=$J$17,0,AE31*(1+Captura!$D$35))","v":0},null,{"$f":"+(W43+AB43+AC43+AD43+AE43+AF43)*Captura!$C$19","v":0},0,null,{"$error":"#DIV/0!"},0]
[null,16,"2027-07-04",{"$f":"IF(B44<J$17,Captura!$O$16,0)+Resumen!$M$29+Resumen!$M$30","v":{"$error":"#DIV/0!"}},null,null,null,0,null,null,{"$f":"IF(B44+1>=$J$17,0,K32*(1+Captura!$D$35))","v":0},{"$f":"IF(B44+1>=$J$17,0,L32*(1+Captura!$D$35))","v":0},{"$f":"IF(B44+1>=$J$17,0,M32*(1+Captura!$D$35))","v":0},null,{"$f":"IF(B44=J$17,Captura!$O$29,0)","v":0},{"$f":"SUM(D44:F44,I44:N44)*Captura!$C$19","v":{"$error":"#DIV/0!"}},{"$error":"#DIV/0!"},null,null,5,16,0,null,{"$f":"+V43*Captura!$O$9/12","v":0},0,0,{"$f":"IF(U44=J$17,Captura!$O$33,0)","v":0},null,{"$f":"IF(U44+1>=$J$17,0,AC32*(1+Captura!$D$35))","v":0},{"$f":"IF(U44+1>=$J$17,0,AD32*(1+Captura!$D$35))","v":0},{"$f":"IF(U44+1>=$J$17,0,AE32*(1+Captura!$D$35))","v":0},null,{"$f":"+(W44+AB44+AC44+AD44+AE44+AF44)*Captura!$C$19","v":0},0,null,{"$error":"#DIV/0!"},0]
[null,17,"2027-08-04",{"$f":"IF(B45<J$17,Captura!$O$16,0)+Resumen!$M$29+Resumen!$M$30","v":{"$error":"#DIV/0!"}},null,null,null,0,null,null,{"$f":"IF(B45+1>=$J$17,0,K33*(1+Captura!$D$35))","v":0},{"$f":"IF(B45+1>=$J$17,0,L33*(1+Captura!$D$35))","v":0},{"$f":"IF(B45+1>=$J$17,0,M33*(1+Captura!$D$35))","v":0},null,{"$f":"IF(B45=J$17,Captura!$O$29,0)","v":0},{"$f":"SUM(D45:F45,I45:N45)*Captura!$C$19","v":{"$error":"#DIV/0!"}},{"$error":"#DIV/0!"},null,null,6,17,0,null,{"$f":"+V44*Captura!$O$9/12","v":0},0,0,{"$f":"IF(U45=J$17,Captura!$O$33,0)","v":0},null,{"$f":"IF(U45+1>=$J$17,0,AC33*(1+Captura!$D$35))","v":0},{"$f":"IF(U45+1>=$J$17,0,AD33*(1+Captura!$D$35))","v":0},{"$f":"IF(U45+1>=$J$17,0,AE33*(1+Captura!$D$35))","v":0},null,{"$f":"+(W45+AB45+AC45+AD45+AE45+AF45)*Captura!$C$19","v":0},0,null,{"$error":"#DIV/0!"},0]
[null,18,"2027-09-04",{"$f":"IF(B46<J$17,Captura!$O$16,0)+Resumen!$M$29+Resumen!$M$30","v":{"$error":"#DIV/0!"}},null,null,null,0,null,null,{"$f":"IF(B46+1>=$J$17,0,K34*(1+Captura!$D$35))","v":0},{"$f":"IF(B46+1>=$J$17,0,L34*(1+Captura!$D$35))","v":0},{"$f":"IF(B46+1>=$J$17,0,M34*(1+Captura!$D$35))","v":0},null,{"$f":"IF(B46=J$17,Captura!$O$29,0)","v":0},{"$f":"SUM(D46:F46,I46:N46)*Captura!$C$19","v":{"$error":"#DIV/0!"}},{"$error":"#DIV/0!"},null,null,7,18,0,null,{"$f":"+V45*Captura!$O$9/12","v":0},0,0,{"$f":"IF(U46=J$17,Captura!$O$33,0)","v":0},null,{"$f":"IF(U46+1>=$J$17,0,AC34*(1+Captura!$D$35))","v":0},{"$f":"IF(U46+1>=$J$17,0,AD34*(1+Captura!$D$35))","v":0},{"$f":"IF(U46+1>=$J$17,0,AE34*(1+Captura!$D$35))","v":0},null,{"$f":"+(W46+AB46+AC46+AD46+AE46+AF46)*Captura!$C$19","v":0},0,null,{"$error":"#DIV/0!"},0]
[null,19,"2027-10-04",{"$f":"IF(B47<J$17,Captura!$O$16,0)+Resumen!$M$29+Resumen!$M$30","v":{"$error":"#DIV/0!"}},null,null,null,0,null,null,{"$f":"IF(B47+1>=$J$17,0,K35*(1+Captura!$D$35))","v":0},{"$f":"IF(B47+1>=$J$17,0,L35*(1+Captura!$D$35))","v":0},{"$f":"IF(B47+1>=$J$17,0,M35*(1+Captura!$D$35))","v":0},null,{"$f":"IF(B47=J$17,Captura!$O$29,0)","v":0},{"$f":"SUM(D47:F47,I47:N47)*Captura!$C$19","v":{"$error":"#DIV/0!"}},{"$error":"#DIV/0!"},null,null,8,19,0,null,{"$f":"+V46*Captura!$O$9/12","v":0},0,0,{"$f":"IF(U47=J$17,Captura!$O$33,0)","v":0},null,{"$f":"IF(U47+1>=$J$17,0,AC35*(1+Captura!$D$35))","v":0},{"$f":"IF(U47+1>=$J$17,0,AD35*(1+Captura!$D$35))","v":0},{"$f":"IF(U47+1>=$J$17,0,AE35*(1+Captura!$D$35))","v":0},null,{"$f":"+(W47+AB47+AC47+AD47+AE47+AF47)*Captura!$C$19","v":0},0,null,{"$error":"#DIV/0!"},0]
[null,20,"2027-11-04",{"$f":"IF(B48<J$17,Captura!$O$16,0)+Resumen!$M$29+Resumen!$M$30","v":{"$error":"#DIV/0!"}},null,null,null,0,null,null,{"$f":"IF(B48+1>=$J$17,0,K36*(1+Captura!$D$35))","v":0},{"$f":"IF(B48+1>=$J$17,0,L36*(1+Captura!$D$35))","v":0},{"$f":"IF(B48+1>=$J$17,0,M36*(1+Captura!$D$35))","v":0},null,{"$f":"IF(B48=J$17,Captura!$O$29,0)","v":0},{"$f":"SUM(D48:F48,I48:N48)*Captura!$C$19","v":{"$error":"#DIV/0!"}},{"$error":"#DIV/0!"},null,null,9,20,0,null,{"$f":"+V47*Captura!$O$9/12","v":0},0,0,{"$f":"IF(U48=J$17,Captura!$O$33,0)","v":0},null,{"$f":"IF(U48+1>=$J$17,0,AC36*(1+Captura!$D$35))","v":0},{"$f":"IF(U48+1>=$J$17,0,AD36*(1+Captura!$D$35))","v":0},{"$f":"IF(U48+1>=$J$17,0,AE36*(1+Captura!$D$35))","v":0},null,{"$f":"+(W48+AB48+AC48+AD48+AE48+AF48)*Captura!$C$19","v":0},0,null,{"$error":"#DIV/0!"},0]
[null,21,"2027-12-04",{"$f":"IF(B49<J$17,Captura!$O$16,0)+Resumen!$M$29+Resumen!$M$30","v":{"$error":"#DIV/0!"}},null,null,null,0,null,null,{"$f":"IF(B49+1>=$J$17,0,K37*(1+Captura!$D$35))","v":0},{"$f":"IF(B49+1>=$J$17,0,L37*(1+Captura!$D$35))","v":0},{"$f":"IF(B49+1>=$J$17,0,M37*(1+Captura!$D$35))","v":0},null,{"$f":"IF(B49=J$17,Captura!$O$29,0)","v":0},{"$f":"SUM(D49:F49,I49:N49)*Captura!$C$19","v":{"$error":"#DIV/0!"}},{"$error":"#DIV/0!"},null,null,10,21,0,null,{"$f":"+V48*Captura!$O$9/12","v":0},0,0,{"$f":"IF(U49=J$17,Captura!$O$33,0)","v":0},null,{"$f":"IF(U49+1>=$J$17,0,AC37*(1+Captura!$D$35))","v":0},{"$f":"IF(U49+1>=$J$17,0,AD37*(1+Captura!$D$35))","v":0},{"$f":"IF(U49+1>=$J$17,0,AE37*(1+Captura!$D$35))","v":0},null,{"$f":"+(W49+AB49+AC49+AD49+AE49+AF49)*Captura!$C$19","v":0},0,null,{"$error":"#DIV/0!"},0]
[null,22,"2028-01-04",{"$f":"IF(B50<J$17,Captura!$O$16,0)+Resumen!$M$29+Resumen!$M$30","v":{"$error":"#DIV/0!"}},null,null,null,0,null,null,{"$f":"IF(B50+1>=$J$17,0,K38*(1+Captura!$D$35))","v":0},{"$f":"IF(B50+1>=$J$17,0,L38*(1+Captura!$D$35))","v":0},{"$f":"IF(B50+1>=$J$17,0,M38*(1+Captura!$D$35))","v":0},null,{"$f":"IF(B50=J$17,Captura!$O$29,0)","v":0},{"$f":"SUM(D50:F50,I50:N50)*Captura!$C$19","v":{"$error":"#DIV/0!"}},{"$error":"#DIV/0!"},null,null,11,22,0,null,{"$f":"+V49*Captura!$O$9/12","v":0},0,0,{"$f":"IF(U50=J$17,Captura!$O$33,0)","v":0},null,{"$f":"IF(U50+1>=$J$17,0,AC38*(1+Captura!$D$35))","v":0},{"$f":"IF(U50+1>=$J$17,0,AD38*(1+Captura!$D$35))","v":0},{"$f":"IF(U50+1>=$J$17,0,AE38*(1+Captura!$D$35))","v":0},null,{"$f":"+(W50+AB50+AC50+AD50+AE50+AF50)*Captura!$C$19","v":0},0,null,{"$error":"#DIV/0!"},0]
[null,23,"2028-02-04",{"$f":"IF(B51<J$17,Captura!$O$16,0)+Resumen!$M$29+Resumen!$M$30","v":{"$error":"#DIV/0!"}},null,null,null,0,null,null,{"$f":"IF(B51+1>=$J$17,0,K39*(1+Captura!$D$35))","v":0},{"$f":"IF(B51+1>=$J$17,0,L39*(1+Captura!$D$35))","v":0},{"$f":"IF(B51+1>=$J$17,0,M39*(1+Captura!$D$35))","v":0},null,{"$f":"IF(B51=J$17,Captura!$O$29,0)","v":0},{"$f":"SUM(D51:F51,I51:N51)*Captura!$C$19","v":{"$error":"#DIV/0!"}},{"$error":"#DIV/0!"},null,null,12,23,0,null,{"$f":"+V50*Captura!$O$9/12","v":0},0,0,{"$f":"IF(U51=J$17,Captura!$O$33,0)","v":0},null,{"$f":"IF(U51+1>=$J$17,0,AC39*(1+Captura!$D$35))","v":0},{"$f":"IF(U51+1>=$J$17,0,AD39*(1+Captura!$D$35))","v":0},{"$f":"IF(U51+1>=$J$17,0,AE39*(1+Captura!$D$35))","v":0},null,{"$f":"+(W51+AB51+AC51+AD51+AE51+AF51)*Captura!$C$19","v":0},0,null,{"$error":"#DIV/0!"},0]
[null,24,"2028-03-04",{"$f":"IF(B52<J$17,Captura!$O$16,0)+Resumen!$M$29+Resumen!$M$30","v":{"$error":"#DIV/0!"}},null,null,null,0,null,null,{"$f":"IF(B52+1>=$J$17,0,K40*(1+Captura!$D$35))","v":0},{"$f":"IF(B52+1>=$J$17,0,L40*(1+Captura!$D$35))","v":0},{"$f":"IF(B52+1>=$J$17,0,M40*(1+Captura!$D$35))","v":0},null,{"$f":"IF(B52=J$17,Captura!$O$29,0)","v":0},{"$f":"SUM(D52:F52,I52:N52)*Captura!$C$19","v":{"$error":"#DIV/0!"}},{"$error":"#DIV/0!"},null,null,1,24,0,null,{"$f":"+V51*Captura!$O$9/12","v":0},0,0,{"$f":"IF(U52=J$17,Captura!$O$33,0)","v":0},null,{"$f":"IF(U52+1>=$J$17,0,AC40*(1+Captura!$D$35))","v":0},{"$f":"IF(U52+1>=$J$17,0,AD40*(1+Captura!$D$35))","v":0},{"$f":"IF(U52+1>=$J$17,0,AE40*(1+Captura!$D$35))","v":411.00799999999998},null,{"$f":"+(W52+AB52+AC52+AD52+AE52+AF52)*Captura!$C$19","v":65.761279999999999},476.76927999999998,null,{"$error":"#DIV/0!"},-411.00799999999998]
[null,25,"2028-04-04",{"$f":"IF(B53<J$17,Captura!$O$16,0)+Resumen!$M$29+Resumen!$M$30","v":{"$error":"#DIV/0!"}},null,null,null,0,null,null,{"$f":"IF(B53+1>=$J$17,0,K41*(1+Captura!$D$35))","v":0},{"$f":"IF(B53+1>=$J$17,0,L41*(1+Captura!$D$35))","v":0},{"$f":"IF(B53+1>=$J$17,0,M41*(1+Captura!$D$35))","v":0},null,{"$f":"IF(B53=J$17,Captura!$O$29,0)","v":0},{"$f":"SUM(D53:F53,I53:N53)*Captura!$C$19","v":{"$error":"#DIV/0!"}},{"$error":"#DIV/0!"},null,null,2,25,0,null,{"$f":"+V52*Captura!$O$9/12","v":0},0,0,{"$f":"IF(U53=J$17,Captura!$O$33,0)","v":0},null,{"$f":"IF(U53+1>=$J$17,0,AC41*(1+Captura!$D$35))","v":0},{"$f":"IF(U53+1>=$J$17,0,AD41*(1+Captura!$D$35))","v":0},{"$f":"IF(U53+1>=$J$17,0,AE41*(1+Captura!$D$35))","v":0},null,{"$f":"+(W53+AB53+AC53+AD53+AE53+AF53)*Captura!$C$19","v":0},0,null,{"$error":"#DIV/0!"},0]
[null,26,"2028-05-04",{"$f":"IF(B54<J$17,Captura!$O$16,0)+Resumen!$M$29+Resumen!$M$30","v":{"$error":"#DIV/0!"}},null,null,null,0,null,null,{"$f":"IF(B54+1>=$J$17,0,K42*(1+Captura!$D$35))","v":0},{"$f":"IF(B54+1>=$J$17,0,L42*(1+Captura!$D$35))","v":0},{"$f":"IF(B54+1>=$J$17,0,M42*(1+Captura!$D$35))","v":0},null,{"$f":"IF(B54=J$17,Captura!$O$29,0)","v":0},{"$f":"SUM(D54:F54,I54:N54)*Captura!$C$19","v":{"$error":"#DIV/0!"}},{"$error":"#DIV/0!"},null,null,3,26,0,null,{"$f":"+V53*Captura!$O$9/12","v":0},0,0,{"$f":"IF(U54=J$17,Captura!$O$33,0)","v":0},null,{"$f":"IF(U54+1>=$J$17,0,AC42*(1+Captura!$D$35))","v":0},{"$f":"IF(U54+1>=$J$17,0,AD42*(1+Captura!$D$35))","v":0},{"$f":"IF(U54+1>=$J$17,0,AE42*(1+Captura!$D$35))","v":0},null,{"$f":"+(W54+AB54+AC54+AD54+AE54+AF54)*Captura!$C$19","v":0},0,null,{"$error":"#DIV/0!"},0]
[null,27,"2028-06-04",{"$f":"IF(B55<J$17,Captura!$O$16,0)+Resumen!$M$29+Resumen!$M$30","v":{"$error":"#DIV/0!"}},null,null,null,0,null,null,{"$f":"IF(B55+1>=$J$17,0,K43*(1+Captura!$D$35))","v":0},{"$f":"IF(B55+1>=$J$17,0,L43*(1+Captura!$D$35))","v":0},{"$f":"IF(B55+1>=$J$17,0,M43*(1+Captura!$D$35))","v":0},null,{"$f":"IF(B55=J$17,Captura!$O$29,0)","v":0},{"$f":"SUM(D55:F55,I55:N55)*Captura!$C$19","v":{"$error":"#DIV/0!"}},{"$error":"#DIV/0!"},null,null,4,27,0,null,{"$f":"+V54*Captura!$O$9/12","v":0},0,0,{"$f":"IF(U55=J$17,Captura!$O$33,0)","v":0},null,{"$f":"IF(U55+1>=$J$17,0,AC43*(1+Captura!$D$35))","v":0},{"$f":"IF(U55+1>=$J$17,0,AD43*(1+Captura!$D$35))","v":0},{"$f":"IF(U55+1>=$J$17,0,AE43*(1+Captura!$D$35))","v":0},null,{"$f":"+(W55+AB55+AC55+AD55+AE55+AF55)*Captura!$C$19","v":0},0,null,{"$error":"#DIV/0!"},0]
[null,28,"2028-07-04",{"$f":"IF(B56<J$17,Captura!$O$16,0)+Resumen!$M$29+Resumen!$M$30","v":{"$error":"#DIV/0!"}},null,null,null,0,null,null,{"$f":"IF(B56+1>=$J$17,0,K44*(1+Captura!$D$35))","v":0},{"$f":"IF(B56+1>=$J$17,0,L44*(1+Captura!$D$35))","v":0},{"$f":"IF(B56+1>=$J$17,0,M44*(1+Captura!$D$35))","v":0},null,{"$f":"IF(B56=J$17,Captura!$O$29,0)","v":0},{"$f":"SUM(D56:F56,I56:N56)*Captura!$C$19","v":{"$error":"#DIV/0!"}},{"$error":"#DIV/0!"},null,null,5,28,0,null,{"$f":"+V55*Captura!$O$9/12","v":0},0,0,{"$f":"IF(U56=J$17,Captura!$O$33,0)","v":0},null,{"$f":"IF(U56+1>=$J$17,0,AC44*(1+Captura!$D$35))","v":0},{"$f":"IF(U56+1>=$J$17,0,AD44*(1+Captura!$D$35))","v":0},{"$f":"IF(U56+1>=$J$17,0,AE44*(1+Captura!$D$35))","v":0},null,{"$f":"+(W56+AB56+AC56+AD56+AE56+AF56)*Captura!$C$19","v":0},0,null,{"$error":"#DIV/0!"},0]
[null,29,"2028-08-04",{"$f":"IF(B57<J$17,Captura!$O$16,0)+Resumen!$M$29+Resumen!$M$30","v":{"$error":"#DIV/0!"}},null,null,null,0,null,null,{"$f":"IF(B57+1>=$J$17,0,K45*(1+Captura!$D$35))","v":0},{"$f":"IF(B57+1>=$J$17,0,L45*(1+Captura!$D$35))","v":0},{"$f":"IF(B57+1>=$J$17,0,M45*(1+Captura!$D$35))","v":0},null,{"$f":"IF(B57=J$17,Captura!$O$29,0)","v":0},{"$f":"SUM(D57:F57,I57:N57)*Captura!$C$19","v":{"$error":"#DIV/0!"}},{"$error":"#DIV/0!"},null,null,6,29,0,null,{"$f":"+V56*Captura!$O$9/12","v":0},0,0,{"$f":"IF(U57=J$17,Captura!$O$33,0)","v":0},null,{"$f":"IF(U57+1>=$J$17,0,AC45*(1+Captura!$D$35))","v":0},{"$f":"IF(U57+1>=$J$17,0,AD45*(1+Captura!$D$35))","v":0},{"$f":"IF(U57+1>=$J$17,0,AE45*(1+Captura!$D$35))","v":0},null,{"$f":"+(W57+AB57+AC57+AD57+AE57+AF57)*Captura!$C$19","v":0},0,null,{"$error":"#DIV/0!"},0]
[null,30,"2028-09-04",{"$f":"IF(B58<J$17,Captura!$O$16,0)+Resumen!$M$29+Resumen!$M$30","v":{"$error":"#DIV/0!"}},null,null,null,0,null,null,{"$f":"IF(B58+1>=$J$17,0,K46*(1+Captura!$D$35))","v":0},{"$f":"IF(B58+1>=$J$17,0,L46*(1+Captura!$D$35))","v":0},{"$f":"IF(B58+1>=$J$17,0,M46*(1+Captura!$D$35))","v":0},null,{"$f":"IF(B58=J$17,Captura!$O$29,0)","v":0},{"$f":"SUM(D58:F58,I58:N58)*Captura!$C$19","v":{"$error":"#DIV/0!"}},{"$error":"#DIV/0!"},null,null,7,30,0,null,{"$f":"+V57*Captura!$O$9/12","v":0},0,0,{"$f":"IF(U58=J$17,Captura!$O$33,0)","v":0},null,{"$f":"IF(U58+1>=$J$17,0,AC46*(1+Captura!$D$35))","v":0},{"$f":"IF(U58+1>=$J$17,0,AD46*(1+Captura!$D$35))","v":0},{"$f":"IF(U58+1>=$J$17,0,AE46*(1+Captura!$D$35))","v":0},null,{"$f":"+(W58+AB58+AC58+AD58+AE58+AF58)*Captura!$C$19","v":0},0,null,{"$error":"#DIV/0!"},0]
[null,31,"2028-10-04",{"$f":"IF(B59<J$17,Captura!$O$16,0)+Resumen!$M$29+Resumen!$M$30","v":{"$error":"#DIV/0!"}},null,null,null,0,null,null,{"$f":"IF(B59+1>=$J$17,0,K47*(1+Captura!$D$35))","v":0},{"$f":"IF(B59+1>=$J$17,0,L47*(1+Captura!$D$35))","v":0},{"$f":"IF(B59+1>=$J$17,0,M47*(1+Captura!$D$35))","v":0},null,{"$f":"IF(B59=J$17,Captura!$O$29,0)","v":0},{"$f":"SUM(D59:F59,I59:N59)*Captura!$C$19","v":{"$error":"#DIV/0!"}},{"$error":"#DIV/0!"},null,null,8,31,0,null,{"$f":"+V58*Captura!$O$9/12","v":0},0,0,{"$f":"IF(U59=J$17,Captura!$O$33,0)","v":0},null,{"$f":"IF(U59+1>=$J$17,0,AC47*(1+Captura!$D$35))","v":0},{"$f":"IF(U59+1>=$J$17,0,AD47*(1+Captura!$D$35))","v":0},{"$f":"IF(U59+1>=$J$17,0,AE47*(1+Captura!$D$35))","v":0},null,{"$f":"+(W59+AB59+AC59+AD59+AE59+AF59)*Captura!$C$19","v":0},0,null,{"$error":"#DIV/0!"},0]
[null,32,"2028-11-04",{"$f":"IF(B60<J$17,Captura!$O$16,0)+Resumen!$M$29+Resumen!$M$30","v":{"$error":"#DIV/0!"}},null,null,null,0,null,null,{"$f":"IF(B60+1>=$J$17,0,K48*(1+Captura!$D$35))","v":0},{"$f":"IF(B60+1>=$J$17,0,L48*(1+Captura!$D$35))","v":0},{"$f":"IF(B60+1>=$J$17,0,M48*(1+Captura!$D$35))","v":0},null,{"$f":"IF(B60=J$17,Captura!$O$29,0)","v":0},{"$f":"SUM(D60:F60,I60:N60)*Captura!$C$19","v":{"$error":"#DIV/0!"}},{"$error":"#DIV/0!"},null,null,9,32,0,null,{"$f":"+V59*Captura!$O$9/12","v":0},0,0,{"$f":"IF(U60=J$17,Captura!$O$33,0)","v":0},null,{"$f":"IF(U60+1>=$J$17,0,AC48*(1+Captura!$D$35))","v":0},{"$f":"IF(U60+1>=$J$17,0,AD48*(1+Captura!$D$35))","v":0},{"$f":"IF(U60+1>=$J$17,0,AE48*(1+Captura!$D$35))","v":0},null,{"$f":"+(W60+AB60+AC60+AD60+AE60+AF60)*Captura!$C$19","v":0},0,null,{"$error":"#DIV/0!"},0]
[null,33,"2028-12-04",{"$f":"IF(B61<J$17,Captura!$O$16,0)+Resumen!$M$29+Resumen!$M$30","v":{"$error":"#DIV/0!"}},null,null,null,0,null,null,{"$f":"IF(B61+1>=$J$17,0,K49*(1+Captura!$D$35))","v":0},{"$f":"IF(B61+1>=$J$17,0,L49*(1+Captura!$D$35))","v":0},{"$f":"IF(B61+1>=$J$17,0,M49*(1+Captura!$D$35))","v":0},null,{"$f":"IF(B61=J$17,Captura!$O$29,0)","v":0},{"$f":"SUM(D61:F61,I61:N61)*Captura!$C$19","v":{"$error":"#DIV/0!"}},{"$error":"#DIV/0!"},null,null,10,33,0,null,{"$f":"+V60*Captura!$O$9/12","v":0},0,0,{"$f":"IF(U61=J$17,Captura!$O$33,0)","v":0},null,{"$f":"IF(U61+1>=$J$17,0,AC49*(1+Captura!$D$35))","v":0},{"$f":"IF(U61+1>=$J$17,0,AD49*(1+Captura!$D$35))","v":0},{"$f":"IF(U61+1>=$J$17,0,AE49*(1+Captura!$D$35))","v":0},null,{"$f":"+(W61+AB61+AC61+AD61+AE61+AF61)*Captura!$C$19","v":0},0,null,{"$error":"#DIV/0!"},0]
[null,34,"2029-01-04",{"$f":"IF(B62<J$17,Captura!$O$16,0)+Resumen!$M$29+Resumen!$M$30","v":{"$error":"#DIV/0!"}},null,null,null,0,null,null,{"$f":"IF(B62+1>=$J$17,0,K50*(1+Captura!$D$35))","v":0},{"$f":"IF(B62+1>=$J$17,0,L50*(1+Captura!$D$35))","v":0},{"$f":"IF(B62+1>=$J$17,0,M50*(1+Captura!$D$35))","v":0},null,{"$f":"IF(B62=J$17,Captura!$O$29,0)","v":0},{"$f":"SUM(D62:F62,I62:N62)*Captura!$C$19","v":{"$error":"#DIV/0!"}},{"$error":"#DIV/0!"},null,null,11,34,0,null,{"$f":"+V61*Captura!$O$9/12","v":0},0,0,{"$f":"IF(U62=J$17,Captura!$O$33,0)","v":0},null,{"$f":"IF(U62+1>=$J$17,0,AC50*(1+Captura!$D$35))","v":0},{"$f":"IF(U62+1>=$J$17,0,AD50*(1+Captura!$D$35))","v":0},{"$f":"IF(U62+1>=$J$17,0,AE50*(1+Captura!$D$35))","v":0},null,{"$f":"+(W62+AB62+AC62+AD62+AE62+AF62)*Captura!$C$19","v":0},0,null,{"$error":"#DIV/0!"},0]
[null,35,"2029-02-04",{"$f":"IF(B63<J$17,Captura!$O$16,0)+Resumen!$M$29+Resumen!$M$30","v":{"$error":"#DIV/0!"}},null,null,null,0,null,null,{"$f":"IF(B63+1>=$J$17,0,K51*(1+Captura!$D$35))","v":0},{"$f":"IF(B63+1>=$J$17,0,L51*(1+Captura!$D$35))","v":0},{"$f":"IF(B63+1>=$J$17,0,M51*(1+Captura!$D$35))","v":0},null,{"$f":"IF(B63=J$17,Captura!$O$29,0)","v":0},{"$f":"SUM(D63:F63,I63:N63)*Captura!$C$19","v":{"$error":"#DIV/0!"}},{"$error":"#DIV/0!"},null,null,12,35,0,null,{"$f":"+V62*Captura!$O$9/12","v":0},0,0,{"$f":"IF(U63=J$17,Captura!$O$33,0)","v":0},null,{"$f":"IF(U63+1>=$J$17,0,AC51*(1+Captura!$D$35))","v":0},{"$f":"IF(U63+1>=$J$17,0,AD51*(1+Captura!$D$35))","v":0},{"$f":"IF(U63+1>=$J$17,0,AE51*(1+Captura!$D$35))","v":0},null,{"$f":"+(W63+AB63+AC63+AD63+AE63+AF63)*Captura!$C$19","v":0},0,null,{"$error":"#DIV/0!"},0]
[null,36,"2029-03-04",{"$f":"IF(B64<J$17,Captura!$O$16,0)+Resumen!$M$29+Resumen!$M$30","v":{"$error":"#DIV/0!"}},null,null,null,0,null,null,{"$f":"IF(B64+1>=$J$17,0,K52*(1+Captura!$D$35))","v":0},{"$f":"IF(B64+1>=$J$17,0,L52*(1+Captura!$D$35))","v":0},{"$f":"IF(B64+1>=$J$17,0,M52*(1+Captura!$D$35))","v":0},null,{"$f":"IF(B64=J$17,Captura!$O$29,0)","v":0},{"$f":"SUM(D64:F64,I64:N64)*Captura!$C$19","v":{"$error":"#DIV/0!"}},{"$error":"#DIV/0!"},null,null,1,36,0,null,{"$f":"+V63*Captura!$O$9/12","v":0},0,0,{"$f":"IF(U64=J$17,Captura!$O$33,0)","v":0},null,{"$f":"IF(U64+1>=$J$17,0,AC52*(1+Captura!$D$35))","v":0},{"$f":"IF(U64+1>=$J$17,0,AD52*(1+Captura!$D$35))","v":0},{"$f":"IF(U64+1>=$J$17,0,AE52*(1+Captura!$D$35))","v":427.44831999999997},null,{"$f":"+(W64+AB64+AC64+AD64+AE64+AF64)*Captura!$C$19","v":68.391731199999995},495.84005119999995,null,{"$error":"#DIV/0!"},-427.44831999999997]
[null,37,"2029-04-04",{"$f":"IF(B65<J$17,Captura!$O$16,0)+Resumen!$M$29+Resumen!$M$30","v":{"$error":"#DIV/0!"}},null,null,null,0,null,null,{"$f":"IF(B65+1>=$J$17,0,K53*(1+Captura!$D$35))","v":0},{"$f":"IF(B65+1>=$J$17,0,L53*(1+Captura!$D$35))","v":0},{"$f":"IF(B65+1>=$J$17,0,M53*(1+Captura!$D$35))","v":0},null,{"$f":"IF(B65=J$17,Captura!$O$29,0)","v":0},{"$f":"SUM(D65:F65,I65:N65)*Captura!$C$19","v":{"$error":"#DIV/0!"}},{"$error":"#DIV/0!"},null,null,2,37,0,null,{"$f":"+V64*Captura!$O$9/12","v":0},0,0,{"$f":"IF(U65=J$17,Captura!$O$33,0)","v":0},null,{"$f":"IF(U65+1>=$J$17,0,AC53*(1+Captura!$D$35))","v":0},{"$f":"IF(U65+1>=$J$17,0,AD53*(1+Captura!$D$35))","v":0},{"$f":"IF(U65+1>=$J$17,0,AE53*(1+Captura!$D$35))","v":0},null,{"$f":"+(W65+AB65+AC65+AD65+AE65+AF65)*Captura!$C$19","v":0},0,null,{"$error":"#DIV/0!"},0]
[null,38,"2029-05-04",{"$f":"IF(B66<J$17,Captura!$O$16,0)+Resumen!$M$29+Resumen!$M$30","v":{"$error":"#DIV/0!"}},null,null,null,0,null,null,{"$f":"IF(B66+1>=$J$17,0,K54*(1+Captura!$D$35))","v":0},{"$f":"IF(B66+1>=$J$17,0,L54*(1+Captura!$D$35))","v":0},{"$f":"IF(B66+1>=$J$17,0,M54*(1+Captura!$D$35))","v":0},null,{"$f":"IF(B66=J$17,Captura!$O$29,0)","v":0},{"$f":"SUM(D66:F66,I66:N66)*Captura!$C$19","v":{"$error":"#DIV/0!"}},{"$error":"#DIV/0!"},null,null,3,38,0,null,{"$f":"+V65*Captura!$O$9/12","v":0},0,0,{"$f":"IF(U66=J$17,Captura!$O$33,0)","v":0},null,{"$f":"IF(U66+1>=$J$17,0,AC54*(1+Captura!$D$35))","v":0},{"$f":"IF(U66+1>=$J$17,0,AD54*(1+Captura!$D$35))","v":0},{"$f":"IF(U66+1>=$J$17,0,AE54*(1+Captura!$D$35))","v":0},null,{"$f":"+(W66+AB66+AC66+AD66+AE66+AF66)*Captura!$C$19","v":0},0,null,{"$error":"#DIV/0!"},0]
[null,39,"2029-06-04",{"$f":"IF(B67<J$17,Captura!$O$16,0)+Resumen!$M$29+Resumen!$M$30","v":{"$error":"#DIV/0!"}},null,null,null,0,null,null,{"$f":"IF(B67+1>=$J$17,0,K55*(1+Captura!$D$35))","v":0},{"$f":"IF(B67+1>=$J$17,0,L55*(1+Captura!$D$35))","v":0},{"$f":"IF(B67+1>=$J$17,0,M55*(1+Captura!$D$35))","v":0},null,{"$f":"IF(B67=J$17,Captura!$O$29,0)","v":0},{"$f":"SUM(D67:F67,I67:N67)*Captura!$C$19","v":{"$error":"#DIV/0!"}},{"$error":"#DIV/0!"},null,null,4,39,0,null,{"$f":"+V66*Captura!$O$9/12","v":0},0,0,{"$f":"IF(U67=J$17,Captura!$O$33,0)","v":0},null,{"$f":"IF(U67+1>=$J$17,0,AC55*(1+Captura!$D$35))","v":0},{"$f":"IF(U67+1>=$J$17,0,AD55*(1+Captura!$D$35))","v":0},{"$f":"IF(U67+1>=$J$17,0,AE55*(1+Captura!$D$35))","v":0},null,{"$f":"+(W67+AB67+AC67+AD67+AE67+AF67)*Captura!$C$19","v":0},0,null,{"$error":"#DIV/0!"},0]
[null,40,"2029-07-04",{"$f":"IF(B68<J$17,Captura!$O$16,0)+Resumen!$M$29+Resumen!$M$30","v":{"$error":"#DIV/0!"}},null,null,null,0,null,null,{"$f":"IF(B68+1>=$J$17,0,K56*(1+Captura!$D$35))","v":0},{"$f":"IF(B68+1>=$J$17,0,L56*(1+Captura!$D$35))","v":0},{"$f":"IF(B68+1>=$J$17,0,M56*(1+Captura!$D$35))","v":0},null,{"$f":"IF(B68=J$17,Captura!$O$29,0)","v":0},{"$f":"SUM(D68:F68,I68:N68)*Captura!$C$19","v":{"$error":"#DIV/0!"}},{"$error":"#DIV/0!"},null,null,5,40,0,null,{"$f":"+V67*Captura!$O$9/12","v":0},0,0,{"$f":"IF(U68=J$17,Captura!$O$33,0)","v":0},null,{"$f":"IF(U68+1>=$J$17,0,AC56*(1+Captura!$D$35))","v":0},{"$f":"IF(U68+1>=$J$17,0,AD56*(1+Captura!$D$35))","v":0},{"$f":"IF(U68+1>=$J$17,0,AE56*(1+Captura!$D$35))","v":0},null,{"$f":"+(W68+AB68+AC68+AD68+AE68+AF68)*Captura!$C$19","v":0},0,null,{"$error":"#DIV/0!"},0]
[null,41,"2029-08-04",{"$f":"IF(B69<J$17,Captura!$O$16,0)+Resumen!$M$29+Resumen!$M$30","v":{"$error":"#DIV/0!"}},null,null,null,0,null,null,{"$f":"IF(B69+1>=$J$17,0,K57*(1+Captura!$D$35))","v":0},{"$f":"IF(B69+1>=$J$17,0,L57*(1+Captura!$D$35))","v":0},{"$f":"IF(B69+1>=$J$17,0,M57*(1+Captura!$D$35))","v":0},null,{"$f":"IF(B69=J$17,Captura!$O$29,0)","v":0},{"$f":"SUM(D69:F69,I69:N69)*Captura!$C$19","v":{"$error":"#DIV/0!"}},{"$error":"#DIV/0!"},null,null,6,41,0,null,{"$f":"+V68*Captura!$O$9/12","v":0},0,0,{"$f":"IF(U69=J$17,Captura!$O$33,0)","v":0},null,{"$f":"IF(U69+1>=$J$17,0,AC57*(1+Captura!$D$35))","v":0},{"$f":"IF(U69+1>=$J$17,0,AD57*(1+Captura!$D$35))","v":0},{"$f":"IF(U69+1>=$J$17,0,AE57*(1+Captura!$D$35))","v":0},null,{"$f":"+(W69+AB69+AC69+AD69+AE69+AF69)*Captura!$C$19","v":0},0,null,{"$error":"#DIV/0!"},0]
[null,42,"2029-09-04",{"$f":"IF(B70<J$17,Captura!$O$16,0)+Resumen!$M$29+Resumen!$M$30","v":{"$error":"#DIV/0!"}},null,null,null,0,null,null,{"$f":"IF(B70+1>=$J$17,0,K58*(1+Captura!$D$35))","v":0},{"$f":"IF(B70+1>=$J$17,0,L58*(1+Captura!$D$35))","v":0},{"$f":"IF(B70+1>=$J$17,0,M58*(1+Captura!$D$35))","v":0},null,{"$f":"IF(B70=J$17,Captura!$O$29,0)","v":0},{"$f":"SUM(D70:F70,I70:N70)*Captura!$C$19","v":{"$error":"#DIV/0!"}},{"$error":"#DIV/0!"},null,null,7,42,0,null,{"$f":"+V69*Captura!$O$9/12","v":0},0,0,{"$f":"IF(U70=J$17,Captura!$O$33,0)","v":0},null,{"$f":"IF(U70+1>=$J$17,0,AC58*(1+Captura!$D$35))","v":0},{"$f":"IF(U70+1>=$J$17,0,AD58*(1+Captura!$D$35))","v":0},{"$f":"IF(U70+1>=$J$17,0,AE58*(1+Captura!$D$35))","v":0},null,{"$f":"+(W70+AB70+AC70+AD70+AE70+AF70)*Captura!$C$19","v":0},0,null,{"$error":"#DIV/0!"},0]
[null,43,"2029-10-04",{"$f":"IF(B71<J$17,Captura!$O$16,0)+Resumen!$M$29+Resumen!$M$30","v":{"$error":"#DIV/0!"}},null,null,null,0,null,null,{"$f":"IF(B71+1>=$J$17,0,K59*(1+Captura!$D$35))","v":0},{"$f":"IF(B71+1>=$J$17,0,L59*(1+Captura!$D$35))","v":0},{"$f":"IF(B71+1>=$J$17,0,M59*(1+Captura!$D$35))","v":0},null,{"$f":"IF(B71=J$17,Captura!$O$29,0)","v":0},{"$f":"SUM(D71:F71,I71:N71)*Captura!$C$19","v":{"$error":"#DIV/0!"}},{"$error":"#DIV/0!"},null,null,8,43,0,null,{"$f":"+V70*Captura!$O$9/12","v":0},0,0,{"$f":"IF(U71=J$17,Captura!$O$33,0)","v":0},null,{"$f":"IF(U71+1>=$J$17,0,AC59*(1+Captura!$D$35))","v":0},{"$f":"IF(U71+1>=$J$17,0,AD59*(1+Captura!$D$35))","v":0},{"$f":"IF(U71+1>=$J$17,0,AE59*(1+Captura!$D$35))","v":0},null,{"$f":"+(W71+AB71+AC71+AD71+AE71+AF71)*Captura!$C$19","v":0},0,null,{"$error":"#DIV/0!"},0]
[null,44,"2029-11-04",{"$f":"IF(B72<J$17,Captura!$O$16,0)+Resumen!$M$29+Resumen!$M$30","v":{"$error":"#DIV/0!"}},null,null,null,0,null,null,{"$f":"IF(B72+1>=$J$17,0,K60*(1+Captura!$D$35))","v":0},{"$f":"IF(B72+1>=$J$17,0,L60*(1+Captura!$D$35))","v":0},{"$f":"IF(B72+1>=$J$17,0,M60*(1+Captura!$D$35))","v":0},null,{"$f":"IF(B72=J$17,Captura!$O$29,0)","v":0},{"$f":"SUM(D72:F72,I72:N72)*Captura!$C$19","v":{"$error":"#DIV/0!"}},{"$error":"#DIV/0!"},null,null,9,44,0,null,{"$f":"+V71*Captura!$O$9/12","v":0},0,0,{"$f":"IF(U72=J$17,Captura!$O$33,0)","v":0},null,{"$f":"IF(U72+1>=$J$17,0,AC60*(1+Captura!$D$35))","v":0},{"$f":"IF(U72+1>=$J$17,0,AD60*(1+Captura!$D$35))","v":0},{"$f":"IF(U72+1>=$J$17,0,AE60*(1+Captura!$D$35))","v":0},null,{"$f":"+(W72+AB72+AC72+AD72+AE72+AF72)*Captura!$C$19","v":0},0,null,{"$error":"#DIV/0!"},0]
[null,45,"2029-12-04",{"$f":"IF(B73<J$17,Captura!$O$16,0)+Resumen!$M$29+Resumen!$M$30","v":{"$error":"#DIV/0!"}},null,null,null,0,null,null,{"$f":"IF(B73+1>=$J$17,0,K61*(1+Captura!$D$35))","v":0},{"$f":"IF(B73+1>=$J$17,0,L61*(1+Captura!$D$35))","v":0},{"$f":"IF(B73+1>=$J$17,0,M61*(1+Captura!$D$35))","v":0},null,{"$f":"IF(B73=J$17,Captura!$O$29,0)","v":0},{"$f":"SUM(D73:F73,I73:N73)*Captura!$C$19","v":{"$error":"#DIV/0!"}},{"$error":"#DIV/0!"},null,null,10,45,0,null,{"$f":"+V72*Captura!$O$9/12","v":0},0,0,{"$f":"IF(U73=J$17,Captura!$O$33,0)","v":0},null,{"$f":"IF(U73+1>=$J$17,0,AC61*(1+Captura!$D$35))","v":0},{"$f":"IF(U73+1>=$J$17,0,AD61*(1+Captura!$D$35))","v":0},{"$f":"IF(U73+1>=$J$17,0,AE61*(1+Captura!$D$35))","v":0},null,{"$f":"+(W73+AB73+AC73+AD73+AE73+AF73)*Captura!$C$19","v":0},0,null,{"$error":"#DIV/0!"},0]
[null,46,"2030-01-04",{"$f":"IF(B74<J$17,Captura!$O$16,0)+Resumen!$M$29+Resumen!$M$30","v":{"$error":"#DIV/0!"}},null,null,null,0,null,null,{"$f":"IF(B74+1>=$J$17,0,K62*(1+Captura!$D$35))","v":0},{"$f":"IF(B74+1>=$J$17,0,L62*(1+Captura!$D$35))","v":0},{"$f":"IF(B74+1>=$J$17,0,M62*(1+Captura!$D$35))","v":0},null,{"$f":"IF(B74=J$17,Captura!$O$29,0)","v":0},{"$f":"SUM(D74:F74,I74:N74)*Captura!$C$19","v":{"$error":"#DIV/0!"}},{"$error":"#DIV/0!"},null,null,11,46,0,null,{"$f":"+V73*Captura!$O$9/12","v":0},0,0,{"$f":"IF(U74=J$17,Captura!$O$33,0)","v":0},null,{"$f":"IF(U74+1>=$J$17,0,AC62*(1+Captura!$D$35))","v":0},{"$f":"IF(U74+1>=$J$17,0,AD62*(1+Captura!$D$35))","v":0},{"$f":"IF(U74+1>=$J$17,0,AE62*(1+Captura!$D$35))","v":0},null,{"$f":"+(W74+AB74+AC74+AD74+AE74+AF74)*Captura!$C$19","v":0},0,null,{"$error":"#DIV/0!"},0]
[null,47,"2030-02-04",{"$f":"IF(B75<J$17,Captura!$O$16,0)+Resumen!$M$29+Resumen!$M$30","v":{"$error":"#DIV/0!"}},null,null,null,0,null,null,{"$f":"IF(B75+1>=$J$17,0,K63*(1+Captura!$D$35))","v":0},{"$f":"IF(B75+1>=$J$17,0,L63*(1+Captura!$D$35))","v":0},{"$f":"IF(B75+1>=$J$17,0,M63*(1+Captura!$D$35))","v":0},null,{"$f":"IF(B75=J$17,Captura!$O$29,0)","v":0},{"$f":"SUM(D75:F75,I75:N75)*Captura!$C$19","v":{"$error":"#DIV/0!"}},{"$error":"#DIV/0!"},null,null,12,47,0,null,{"$f":"+V74*Captura!$O$9/12","v":0},0,0,{"$f":"IF(U75=J$17,Captura!$O$33,0)","v":0},null,{"$f":"IF(U75+1>=$J$17,0,AC63*(1+Captura!$D$35))","v":0},{"$f":"IF(U75+1>=$J$17,0,AD63*(1+Captura!$D$35))","v":0},{"$f":"IF(U75+1>=$J$17,0,AE63*(1+Captura!$D$35))","v":0},null,{"$f":"+(W75+AB75+AC75+AD75+AE75+AF75)*Captura!$C$19","v":0},0,null,{"$error":"#DIV/0!"},0]
[null,48,"2030-03-04",{"$f":"IF(B76<J$17,Captura!$O$16,0)+Resumen!$M$29+Resumen!$M$30","v":{"$error":"#DIV/0!"}},null,null,null,0,null,null,{"$f":"IF(B76+1>=$J$17,0,K64*(1+Captura!$D$35))","v":0},{"$f":"IF(B76+1>=$J$17,0,L64*(1+Captura!$D$35))","v":0},{"$f":"IF(B76+1>=$J$17,0,M64*(1+Captura!$D$35))","v":0},null,{"$f":"IF(B76=J$17,Captura!$O$29,0)","v":0},{"$f":"SUM(D76:F76,I76:N76)*Captura!$C$19","v":{"$error":"#DIV/0!"}},{"$error":"#DIV/0!"},null,null,1,48,0,null,{"$f":"+V75*Captura!$O$9/12","v":0},0,0,{"$f":"IF(U76=J$17,Captura!$O$33,0)","v":0},null,{"$f":"IF(U76+1>=$J$17,0,AC64*(1+Captura!$D$35))","v":0},{"$f":"IF(U76+1>=$J$17,0,AD64*(1+Captura!$D$35))","v":0},{"$f":"IF(U76+1>=$J$17,0,AE64*(1+Captura!$D$35))","v":444.54625279999999},null,{"$f":"+(W76+AB76+AC76+AD76+AE76+AF76)*Captura!$C$19","v":71.127400448000003},515.67365324799994,null,{"$error":"#DIV/0!"},-444.54625279999993]
[null,49,"2030-04-04",{"$f":"IF(B77<J$17,Captura!$O$16,0)+Resumen!$M$29+Resumen!$M$30","v":{"$error":"#DIV/0!"}},null,null,null,0,null,null,{"$f":"IF(B77+1>=$J$17,0,K65*(1+Captura!$D$35))","v":0},{"$f":"IF(B77+1>=$J$17,0,L65*(1+Captura!$D$35))","v":0},{"$f":"IF(B77+1>=$J$17,0,M65*(1+Captura!$D$35))","v":0},null,{"$f":"IF(B77=J$17,Captura!$O$29,0)","v":0},{"$f":"SUM(D77:F77,I77:N77)*Captura!$C$19","v":{"$error":"#DIV/0!"}},{"$error":"#DIV/0!"},null,null,2,49,0,null,{"$f":"+V76*Captura!$O$9/12","v":0},0,0,{"$f":"IF(U77=J$17,Captura!$O$33,0)","v":0},null,{"$f":"IF(U77+1>=$J$17,0,AC65*(1+Captura!$D$35))","v":0},{"$f":"IF(U77+1>=$J$17,0,AD65*(1+Captura!$D$35))","v":0},{"$f":"IF(U77+1>=$J$17,0,AE65*(1+Captura!$D$35))","v":0},null,{"$f":"+(W77+AB77+AC77+AD77+AE77+AF77)*Captura!$C$19","v":0},0,null,{"$error":"#DIV/0!"},0]
[null,50,"2030-05-04",{"$f":"IF(B78<J$17,Captura!$O$16,0)+Resumen!$M$29+Resumen!$M$30","v":{"$error":"#DIV/0!"}},null,null,null,0,null,null,{"$f":"IF(B78+1>=$J$17,0,K66*(1+Captura!$D$35))","v":0},{"$f":"IF(B78+1>=$J$17,0,L66*(1+Captura!$D$35))","v":0},{"$f":"IF(B78+1>=$J$17,0,M66*(1+Captura!$D$35))","v":0},null,{"$f":"IF(B78=J$17,Captura!$O$29,0)","v":0},{"$f":"SUM(D78:F78,I78:N78)*Captura!$C$19","v":{"$error":"#DIV/0!"}},{"$error":"#DIV/0!"},null,null,3,50,0,null,{"$f":"+V77*Captura!$O$9/12","v":0},0,0,{"$f":"IF(U78=J$17,Captura!$O$33,0)","v":0},null,{"$f":"IF(U78+1>=$J$17,0,AC66*(1+Captura!$D$35))","v":0},{"$f":"IF(U78+1>=$J$17,0,AD66*(1+Captura!$D$35))","v":0},{"$f":"IF(U78+1>=$J$17,0,AE66*(1+Captura!$D$35))","v":0},null,{"$f":"+(W78+AB78+AC78+AD78+AE78+AF78)*Captura!$C$19","v":0},0,null,{"$error":"#DIV/0!"},0]
[null,51,"2030-06-04",{"$f":"IF(B79<J$17,Captura!$O$16,0)+Resumen!$M$29+Resumen!$M$30","v":{"$error":"#DIV/0!"}},null,null,null,0,null,null,{"$f":"IF(B79+1>=$J$17,0,K67*(1+Captura!$D$35))","v":0},{"$f":"IF(B79+1>=$J$17,0,L67*(1+Captura!$D$35))","v":0},{"$f":"IF(B79+1>=$J$17,0,M67*(1+Captura!$D$35))","v":0},null,{"$f":"IF(B79=J$17,Captura!$O$29,0)","v":0},{"$f":"SUM(D79:F79,I79:N79)*Captura!$C$19","v":{"$error":"#DIV/0!"}},{"$error":"#DIV/0!"},null,null,4,51,0,null,{"$f":"+V78*Captura!$O$9/12","v":0},0,0,{"$f":"IF(U79=J$17,Captura!$O$33,0)","v":0},null,{"$f":"IF(U79+1>=$J$17,0,AC67*(1+Captura!$D$35))","v":0},{"$f":"IF(U79+1>=$J$17,0,AD67*(1+Captura!$D$35))","v":0},{"$f":"IF(U79+1>=$J$17,0,AE67*(1+Captura!$D$35))","v":0},null,{"$f":"+(W79+AB79+AC79+AD79+AE79+AF79)*Captura!$C$19","v":0},0,null,{"$error":"#DIV/0!"},0]
[null,52,"2030-07-04",{"$f":"IF(B80<J$17,Captura!$O$16,0)+Resumen!$M$29+Resumen!$M$30","v":{"$error":"#DIV/0!"}},null,null,null,0,null,null,{"$f":"IF(B80+1>=$J$17,0,K68*(1+Captura!$D$35))","v":0},{"$f":"IF(B80+1>=$J$17,0,L68*(1+Captura!$D$35))","v":0},{"$f":"IF(B80+1>=$J$17,0,M68*(1+Captura!$D$35))","v":0},null,{"$f":"IF(B80=J$17,Captura!$O$29,0)","v":0},{"$f":"SUM(D80:F80,I80:N80)*Captura!$C$19","v":{"$error":"#DIV/0!"}},{"$error":"#DIV/0!"},null,null,5,52,0,null,{"$f":"+V79*Captura!$O$9/12","v":0},0,0,{"$f":"IF(U80=J$17,Captura!$O$33,0)","v":0},null,{"$f":"IF(U80+1>=$J$17,0,AC68*(1+Captura!$D$35))","v":0},{"$f":"IF(U80+1>=$J$17,0,AD68*(1+Captura!$D$35))","v":0},{"$f":"IF(U80+1>=$J$17,0,AE68*(1+Captura!$D$35))","v":0},null,{"$f":"+(W80+AB80+AC80+AD80+AE80+AF80)*Captura!$C$19","v":0},0,null,{"$error":"#DIV/0!"},0]
[null,53,"2030-08-04",{"$f":"IF(B81<J$17,Captura!$O$16,0)+Resumen!$M$29+Resumen!$M$30","v":{"$error":"#DIV/0!"}},null,null,null,0,null,null,{"$f":"IF(B81+1>=$J$17,0,K69*(1+Captura!$D$35))","v":0},{"$f":"IF(B81+1>=$J$17,0,L69*(1+Captura!$D$35))","v":0},{"$f":"IF(B81+1>=$J$17,0,M69*(1+Captura!$D$35))","v":0},null,{"$f":"IF(B81=J$17,Captura!$O$29,0)","v":0},{"$f":"SUM(D81:F81,I81:N81)*Captura!$C$19","v":{"$error":"#DIV/0!"}},{"$error":"#DIV/0!"},null,null,6,53,0,null,{"$f":"+V80*Captura!$O$9/12","v":0},0,0,{"$f":"IF(U81=J$17,Captura!$O$33,0)","v":0},null,{"$f":"IF(U81+1>=$J$17,0,AC69*(1+Captura!$D$35))","v":0},{"$f":"IF(U81+1>=$J$17,0,AD69*(1+Captura!$D$35))","v":0},{"$f":"IF(U81+1>=$J$17,0,AE69*(1+Captura!$D$35))","v":0},null,{"$f":"+(W81+AB81+AC81+AD81+AE81+AF81)*Captura!$C$19","v":0},0,null,{"$error":"#DIV/0!"},0]
[null,54,"2030-09-04",{"$f":"IF(B82<J$17,Captura!$O$16,0)+Resumen!$M$29+Resumen!$M$30","v":{"$error":"#DIV/0!"}},null,null,null,0,null,null,{"$f":"IF(B82+1>=$J$17,0,K70*(1+Captura!$D$35))","v":0},{"$f":"IF(B82+1>=$J$17,0,L70*(1+Captura!$D$35))","v":0},{"$f":"IF(B82+1>=$J$17,0,M70*(1+Captura!$D$35))","v":0},null,{"$f":"IF(B82=J$17,Captura!$O$29,0)","v":0},{"$f":"SUM(D82:F82,I82:N82)*Captura!$C$19","v":{"$error":"#DIV/0!"}},{"$error":"#DIV/0!"},null,null,7,54,0,null,{"$f":"+V81*Captura!$O$9/12","v":0},0,0,{"$f":"IF(U82=J$17,Captura!$O$33,0)","v":0},null,{"$f":"IF(U82+1>=$J$17,0,AC70*(1+Captura!$D$35))","v":0},{"$f":"IF(U82+1>=$J$17,0,AD70*(1+Captura!$D$35))","v":0},{"$f":"IF(U82+1>=$J$17,0,AE70*(1+Captura!$D$35))","v":0},null,{"$f":"+(W82+AB82+AC82+AD82+AE82+AF82)*Captura!$C$19","v":0},0,null,{"$error":"#DIV/0!"},0]
[null,55,"2030-10-04",{"$f":"IF(B83<J$17,Captura!$O$16,0)+Resumen!$M$29+Resumen!$M$30","v":{"$error":"#DIV/0!"}},null,null,null,0,null,null,{"$f":"IF(B83+1>=$J$17,0,K71*(1+Captura!$D$35))","v":0},{"$f":"IF(B83+1>=$J$17,0,L71*(1+Captura!$D$35))","v":0},{"$f":"IF(B83+1>=$J$17,0,M71*(1+Captura!$D$35))","v":0},null,{"$f":"IF(B83=J$17,Captura!$O$29,0)","v":0},{"$f":"SUM(D83:F83,I83:N83)*Captura!$C$19","v":{"$error":"#DIV/0!"}},{"$error":"#DIV/0!"},null,null,8,55,0,null,{"$f":"+V82*Captura!$O$9/12","v":0},0,0,{"$f":"IF(U83=J$17,Captura!$O$33,0)","v":0},null,{"$f":"IF(U83+1>=$J$17,0,AC71*(1+Captura!$D$35))","v":0},{"$f":"IF(U83+1>=$J$17,0,AD71*(1+Captura!$D$35))","v":0},{"$f":"IF(U83+1>=$J$17,0,AE71*(1+Captura!$D$35))","v":0},null,{"$f":"+(W83+AB83+AC83+AD83+AE83+AF83)*Captura!$C$19","v":0},0,null,{"$error":"#DIV/0!"},0]
[null,56,"2030-11-04",{"$f":"IF(B84<J$17,Captura!$O$16,0)+Resumen!$M$29+Resumen!$M$30","v":{"$error":"#DIV/0!"}},null,null,null,0,null,null,{"$f":"IF(B84+1>=$J$17,0,K72*(1+Captura!$D$35))","v":0},{"$f":"IF(B84+1>=$J$17,0,L72*(1+Captura!$D$35))","v":0},{"$f":"IF(B84+1>=$J$17,0,M72*(1+Captura!$D$35))","v":0},null,{"$f":"IF(B84=J$17,Captura!$O$29,0)","v":0},{"$f":"SUM(D84:F84,I84:N84)*Captura!$C$19","v":{"$error":"#DIV/0!"}},{"$error":"#DIV/0!"},null,null,9,56,0,null,{"$f":"+V83*Captura!$O$9/12","v":0},0,0,{"$f":"IF(U84=J$17,Captura!$O$33,0)","v":0},null,{"$f":"IF(U84+1>=$J$17,0,AC72*(1+Captura!$D$35))","v":0},{"$f":"IF(U84+1>=$J$17,0,AD72*(1+Captura!$D$35))","v":0},{"$f":"IF(U84+1>=$J$17,0,AE72*(1+Captura!$D$35))","v":0},null,{"$f":"+(W84+AB84+AC84+AD84+AE84+AF84)*Captura!$C$19","v":0},0,null,{"$error":"#DIV/0!"},0]
[null,57,"2030-12-04",{"$f":"IF(B85<J$17,Captura!$O$16,0)+Resumen!$M$29+Resumen!$M$30","v":{"$error":"#DIV/0!"}},null,null,null,0,null,null,{"$f":"IF(B85+1>=$J$17,0,K73*(1+Captura!$D$35))","v":0},{"$f":"IF(B85+1>=$J$17,0,L73*(1+Captura!$D$35))","v":0},{"$f":"IF(B85+1>=$J$17,0,M73*(1+Captura!$D$35))","v":0},null,{"$f":"IF(B85=J$17,Captura!$O$29,0)","v":0},{"$f":"SUM(D85:F85,I85:N85)*Captura!$C$19","v":{"$error":"#DIV/0!"}},{"$error":"#DIV/0!"},null,null,10,57,0,null,{"$f":"+V84*Captura!$O$9/12","v":0},0,0,{"$f":"IF(U85=J$17,Captura!$O$33,0)","v":0},null,{"$f":"IF(U85+1>=$J$17,0,AC73*(1+Captura!$D$35))","v":0},{"$f":"IF(U85+1>=$J$17,0,AD73*(1+Captura!$D$35))","v":0},{"$f":"IF(U85+1>=$J$17,0,AE73*(1+Captura!$D$35))","v":0},null,{"$f":"+(W85+AB85+AC85+AD85+AE85+AF85)*Captura!$C$19","v":0},0,null,{"$error":"#DIV/0!"},0]
[null,58,"2031-01-04",{"$f":"IF(B86<J$17,Captura!$O$16,0)+Resumen!$M$29+Resumen!$M$30","v":{"$error":"#DIV/0!"}},null,null,null,0,null,null,{"$f":"IF(B86+1>=$J$17,0,K74*(1+Captura!$D$35))","v":0},{"$f":"IF(B86+1>=$J$17,0,L74*(1+Captura!$D$35))","v":0},{"$f":"IF(B86+1>=$J$17,0,M74*(1+Captura!$D$35))","v":0},null,{"$f":"IF(B86=J$17,Captura!$O$29,0)","v":0},{"$f":"SUM(D86:F86,I86:N86)*Captura!$C$19","v":{"$error":"#DIV/0!"}},{"$error":"#DIV/0!"},null,null,11,58,0,null,{"$f":"+V85*Captura!$O$9/12","v":0},0,0,{"$f":"IF(U86=J$17,Captura!$O$33,0)","v":0},null,{"$f":"IF(U86+1>=$J$17,0,AC74*(1+Captura!$D$35))","v":0},{"$f":"IF(U86+1>=$J$17,0,AD74*(1+Captura!$D$35))","v":0},{"$f":"IF(U86+1>=$J$17,0,AE74*(1+Captura!$D$35))","v":0},null,{"$f":"+(W86+AB86+AC86+AD86+AE86+AF86)*Captura!$C$19","v":0},0,null,{"$error":"#DIV/0!"},0]
[null,59,"2031-02-04",{"$f":"IF(B87<J$17,Captura!$O$16,0)+Resumen!$M$29+Resumen!$M$30","v":{"$error":"#DIV/0!"}},null,null,null,0,null,null,{"$f":"IF(B87+1>=$J$17,0,K75*(1+Captura!$D$35))","v":0},{"$f":"IF(B87+1>=$J$17,0,L75*(1+Captura!$D$35))","v":0},{"$f":"IF(B87+1>=$J$17,0,M75*(1+Captura!$D$35))","v":0},null,{"$f":"IF(B87=J$17,Captura!$O$29,0)","v":0},{"$f":"SUM(D87:F87,I87:N87)*Captura!$C$19","v":{"$error":"#DIV/0!"}},{"$error":"#DIV/0!"},null,null,12,59,0,null,{"$f":"+V86*Captura!$O$9/12","v":0},0,0,{"$f":"IF(U87=J$17,Captura!$O$33,0)","v":0},null,{"$f":"IF(U87+1>=$J$17,0,AC75*(1+Captura!$D$35))","v":0},{"$f":"IF(U87+1>=$J$17,0,AD75*(1+Captura!$D$35))","v":0},{"$f":"IF(U87+1>=$J$17,0,AE75*(1+Captura!$D$35))","v":0},null,{"$f":"+(W87+AB87+AC87+AD87+AE87+AF87)*Captura!$C$19","v":0},0,null,{"$error":"#DIV/0!"},0]
[null,60,"2031-03-04",{"$f":"IF(B88<J$17,Captura!$O$16,0)","v":0},null,null,null,0,null,null,{"$f":"IF(B88+1>=$J$17,0,K76*(1+Captura!$D$35))","v":0},{"$f":"IF(B88+1>=$J$17,0,L76*(1+Captura!$D$35))","v":0},{"$f":"IF(B88+1>=$J$17,0,M76*(1+Captura!$D$35))","v":0},null,{"$f":"IF(B88=J$17,Captura!$O$29,0)","v":0},{"$f":"SUM(D88:F88,I88:N88)*Captura!$C$19","v":0},0,null,null,1,60,0,null,{"$f":"+V87*Captura!$O$9/12","v":0},0,0,{"$f":"IF(U88=J$17,Captura!$O$33,0)","v":0},null,{"$f":"IF(U88+1>=$J$17,0,AC76*(1+Captura!$D$35))","v":0},{"$f":"IF(U88+1>=$J$17,0,AD76*(1+Captura!$D$35))","v":0},{"$f":"IF(U88+1>=$J$17,0,AE76*(1+Captura!$D$35))","v":0},null,{"$f":"+(W88+AB88+AC88+AD88+AE88+AF88)*Captura!$C$19","v":0},0,null,0,0]
[]
[]
[]
[null,"Notas:"]
[null,"1. Esta cotización no es una autorización y no representa ninguna obligación para Leasing Mobile de México, S. A. de C. V."]
[null,"2. La información descrita en el presente documento está sujeta a cambios sin previo aviso."]
[null,"3. Esta cotización no considera gastos que el equipo requiera para su adquisición, uso o mantenimiento."]
[null,"4. Las rentas en depósito serán devueltas al cumplimiento de todas las obligaciones contractauales del Arrendatario."]
[]
[]
[]
[]
[]
[]
[]
[]
[]
[]
[null,"__________________________________"]
[null,"Leasing Mobile de Mexico, SA de CV"]
[null,{"$f":"+Captura!D31","v":"xxxx"}]
[null,{"$f":"+Captura!D32","v":"xxxx"}]
[null,{"$f":"+Captura!D33","v":"xxxx"}]